{"text_format":"1","workbook":"xlsx","n_sheets":4,"sheets":["Form","Balance","Tables","Data"],"not_rendered":{"charts":0,"images":1,"macros":1,"external_links":1,"defined_names":329,"comments":1,"pivot_tables":0},"unopened":[],"bounds":{"document_bytes":16777216,"sheet_cells":100000,"rows_first":2000,"rows_last":500,"rows_between":2000,"halvings":0,"cell_chars":16384,"cell_head_chars":4096},"cells_cut":0,"cells_raw":0,"read":"whole","date_system":"1900"}

{"sheet":"Form","index":0,"n_rows":26,"n_cols":16,"rows_kept":26,"cut":false,"hidden":false,"merged":[[3,1,3,7],[3,9,3,12],[2,6,2,7],[2,1,2,5],[28,12,28,13],[25,12,25,13],[27,12,27,13],[26,12,26,13],[2,13,2,14],[3,13,3,14],[13,14,13,15],[17,13,18,15],[2,9,2,12],[6,14,6,15],[5,14,5,15]]}
[]
[null,{"$f":"IF(AND(WSIZE>0,HSIZE>0),\"Only Available At\"&\"  \"&WSIZE&\" x \"&HSIZE&IF(HCONTROL=1,\" or \"&HSIZE2,\"\"),\"\")","v":""},null,null,null,null,null,"Select Model",null,{"$f":"IF(ISERROR(SHATERROR),\"\",IF(SHATERROR=1,\"Adjust CMR to Increase Egress Height\",\"\"))","v":""}]
[null,{"$f":"IF(Model_Select=\"Select Model\",\"\",\"(Model\"&\" \"&ModelNo&\")\")","v":""},null,null,null,null,"Select Model",null,null,{"$f":"\"Min. W:\"&\" \"&MINW","v":"Min. W: 0"},null,null,null,{"$f":"\"Max W:\"&\" \"&MAXW","v":"Max W: 0"}]
[null,{"$f":"Description","v":0},null,null,null,null,null,null,null,{"$f":"\"Min. H:\"&\" \"&MINH","v":"Min. H: 0"},null,null,null,{"$f":"\"Max H:\"&\" \"&MAXH","v":"Max H: 0"},null,{"$f":"\"Max UI:\"&\" \"&MAXUI","v":"Max UI: 0"}]
[null,{"$f":"IF(AND(W>0,H>0),(IF(ISERROR(VLOOKUP(1,Data!$A:$D,3,FALSE)),\"\",VLOOKUP(1,Data!$A:$D,3,FALSE))),\"\")","v":""},null,null,null,{"$f":"IF(ISERROR(SHAT_MIN_R),\"\",IF(SHAT_MIN_R=1,SHAT_MESSAGE,\"\"))","v":""},null,{"$f":"IF(AND(W>0,H>0),(IF(ISERROR(VLOOKUP(1,Data!$A:$D,4,FALSE)),\"\",VLOOKUP(1,Data!$A:$D,4,FALSE))),\"\")","v":""},null,null,null,null,null,"Exact Size"]
[null,{"$f":"IF(AND(W>0,H>0),(IF(ISERROR(VLOOKUP(2,Data!$A:$D,3,FALSE)),\"\",VLOOKUP(2,Data!$A:$D,3,FALSE))),\"\")","v":""},null,null,null,null,null,{"$f":"IF(AND(W>0,H>0),(IF(ISERROR(VLOOKUP(2,Data!$A:$D,4,FALSE)),\"\",VLOOKUP(2,Data!$A:$D,4,FALSE))),\"\")","v":""},null,"Width:",null,null,null,{"$f":"IF(AND(RO=2,W>0),W-WCUTBACK,W)","v":0},{"$f":"IF(AND(W>0,WSIZE>0,W<>WSIZE),\"<< Width Not Available\",\"\")","v":""}]
[null,{"$f":"IF(AND(W>0,H>0),(IF(ISERROR(VLOOKUP(3,Data!$A:$D,3,FALSE)),\"\",VLOOKUP(3,Data!$A:$D,3,FALSE))),\"\")","v":""},null,null,null,null,null,{"$f":"IF(AND(W>0,H>0),(IF(ISERROR(VLOOKUP(3,Data!$A:$D,4,FALSE)),\"\",VLOOKUP(3,Data!$A:$D,4,FALSE))),\"\")","v":""},null,"Height:",null,null,null,{"$f":"IF(AND(RO=2,H>0),H-HCUTBACK,H)","v":0},{"$f":"IF(AND(H>0,HSIZE>0,HSIZE2>0,H<>HSIZE,H<>HSIZE2),\"<< Height Not Available\",\"\")","v":""}]
[null,{"$f":"IF(AND(W>0,H>0),(IF(ISERROR(VLOOKUP(4,Data!$A:$D,3,FALSE)),\"\",VLOOKUP(4,Data!$A:$D,3,FALSE))),\"\")","v":""},null,null,null,null,null,{"$f":"IF(AND(W>0,H>0),(IF(ISERROR(VLOOKUP(4,Data!$A:$D,4,FALSE)),\"\",VLOOKUP(4,Data!$A:$D,4,FALSE))),\"\")","v":""},null,{"$f":"IF(OR(ModelNo=\"S140\",ModelNo=\"S144\",ModelNo=\"S146\",ModelNo=\"S140 (HP)\",ModelNo=\"S144 (HP)\",ModelNo=\"S146 (HP)\"),\"Leg:\",\"\")","v":""},null,null,null,{"$f":"LEG_MESSAGE","v":""}]
[null,{"$f":"IF(AND(W>0,H>0),(IF(ISERROR(VLOOKUP(5,Data!$A:$D,3,FALSE)),\"\",VLOOKUP(5,Data!$A:$D,3,FALSE))),\"\")","v":""},null,null,null,null,null,{"$f":"IF(AND(W>0,H>0),(IF(ISERROR(VLOOKUP(5,Data!$A:$D,4,FALSE)),\"\",VLOOKUP(5,Data!$A:$D,4,FALSE))),\"\")","v":""},null,{"$f":"IF(BTYPE=\"Custom\",\"CMR:\",\"\")","v":""},null,null,null,{"$f":"CMR_MESSAGE","v":0}]
[null,{"$f":"IF(AND(W>0,H>0),(IF(ISERROR(VLOOKUP(6,Data!$A:$D,3,FALSE)),\"\",VLOOKUP(6,Data!$A:$D,3,FALSE))),\"\")","v":""},null,null,null,null,null,{"$f":"IF(AND(W>0,H>0),(IF(ISERROR(VLOOKUP(6,Data!$A:$D,4,FALSE)),\"\",VLOOKUP(6,Data!$A:$D,4,FALSE))),\"\")","v":""},null,{"$f":"IF(SELECTEXT=\"Select Extrusion\",\"Ext.\",IF(SELECTEXT=\"Select Reinforcement\",\"Reinforce\",IF(SELECTEXT=\"Standard\",\"HP >>\",\"\")))","v":""},null,null,null,{"$f":"EXT_MESSAGE","v":""}]
{"$rows_left_out":17}
{"sheet":"Balance","index":1,"n_rows":235,"n_cols":40,"rows_kept":235,"cut":false,"hidden":true,"merged":[[31,34,31,35],[31,37,31,38],[0,14,0,18],[1,12,1,15],[1,17,1,20],[1,24,1,26]]}
[null,null,null,null,null,null,null,null,null,null,null,null,null,null,"BLOCK & TACKLE BALANCE CHART"]
[null,null,null,null,null,null,null,null,null,null,null,null,"TOP SASH",null,null,null,null,"BOTTOM SASH",null,null,null,null,null,null,"CFB"]
[null,"A571/A740","Length","Weight/ft","Weight",null,"3A01","Length","Weight/ft","Weight",null,null,"Sash Weight","Tube Length","Balance","Weight",null,"Sash Weight","Tube Length","Balance","Weight",null,null,{"$f":"VLOOKUP(BTM_WGT,CFB_W,3,FALSE)","v":{"$error":"#N/A"}},4,3,"BN",null,null,"Caldwell Balance Chart"]
[null,"Bottom Top Rail",{"$f":"(BSW_A571)/12","v":-0.17708333333333334},0.24299999999999999,{"$f":"C4*D4","v":-4.303125E-2},null,"Top Top Rail",{"$f":"(TSW_3A01)/12","v":-0.34375},0.29699999999999999,{"$f":"H4*I4","v":-0.10209375},null,null,{"$f":"TRUNC(TOP_WGT+GRID)","v":0},{"$f":"TOPTUBELENGTH","v":0},"Number","Range",null,{"$f":"TRUNC(BTM_WGT+GRID)","v":0},{"$f":"BOTTUBELENGTH","v":{"$error":"#N/A"}},"Number","Range",null,null,null,{"$f":"Y3+1","v":5},3,"BN",null,null,{"$f":"IF(OR(ModelNo=\"1700\",ModelNo=\"1720\",ModelNo=\"1730\"),1,IF(OR(ModelNo=\"1900\",ModelNo=\"1920\",ModelNo=\"1930\"),2,3))","v":3},{"$f":"IF(OR(ModelNo=\"1700\",ModelNo=\"1720\",ModelNo=\"1730\"),4,IF(OR(ModelNo=\"1900\",ModelNo=\"1920\",ModelNo=\"1930\"),5,6))","v":6},"Bott.","Top",null,1,4,2,5,3,6]
[null,"Bottom Bottom Rail",{"$f":"(BSW_A571)/12","v":-0.17708333333333334},0.216,-3.8249999999999999E-2,null,"Top Bottom Rail",{"$f":"(TSW_3A01)/12","v":-0.34375},0.28899999999999998,-9.9343749999999995E-2,null,null,"Balance Size",{"$f":"IF(AND(O5>0,P5>0),O5,0)","v":0},{"$f":"IF($N$4<=7,7,0)","v":7},{"$f":"IF(AND(O5=7,$M$4>=2,$M$4<=2.99),O5&\"-\"&\"1\",0)","v":0},null,"Balance Size",{"$f":"IF(AND(T5>0,U5>0),T5,0)","v":{"$error":"#N/A"}},{"$f":"IF($S$4<=7,7,0)","v":{"$error":"#N/A"}},{"$f":"IF(AND(T5=7,$R$4>=2,$R$4<=2.99),T5&\"-\"&\"1\",0)","v":{"$error":"#N/A"}},null,null,null,6,3,"BN",null,null,{"$f":"HLOOKUP($AD$4,CALDWELL_LOOKUP,2,FALSE)","v":9},{"$f":"HLOOKUP($AE$4,CALDWELL_LOOKUP,2,FALSE)","v":9.9994999999999994},8,7,null,9.7665000000000006,10.766,9.2185000000000006,10.218,9,9.9994999999999994]
[null,"Bottom Stile",{"$f":"((BSH_A581)*2)/12","v":-0.25},0.185,-4.6249999999999999E-2,null,"Top Stile",{"$f":"(2*TSH_3A01)/12","v":-0.27083333333333331},0.218,-5.9041666666666666E-2,null,null,{"$f":"VLOOKUP((MAX(N5:P235)),N5:P235,3,FALSE)","v":{"$error":"#N/A"}},0,7,{"$f":"IF(AND(O6=7,$M$4>=3,$M$4<=3.99),O6&\"-\"&\"2\",0)","v":0},null,{"$f":"VLOOKUP((MAX(S5:S235)),S5:U235,3,FALSE)","v":{"$error":"#N/A"}},{"$error":"#N/A"},{"$error":"#N/A"},{"$f":"IF(AND(T6=7,$R$4>=3,$R$4<=3.99),T6&\"-\"&\"2\",0)","v":{"$error":"#N/A"}},null,null,null,7,4,"RD",null,null,{"$f":"HLOOKUP($AD$4,CALDWELL_LOOKUP,3,FALSE)","v":10},{"$f":"HLOOKUP($AE$4,CALDWELL_LOOKUP,3,FALSE)","v":10.999499999999999},9,8,null,10.766500000000001,11.766,10.218500000000001,11.218,10,10.999499999999999]
[null,"Bottom Rail Reinf.",{"$f":"((C4*12)-3)/12","v":-0.42708333333333331},0.17199999999999999,-7.345833333333332E-2,null,"Keeper Rail Reinf.",{"$f":"(TRUNC(((Frame_Width-4.125)-6)/2)*2)/12","v":-0.83333333333333337},{"$f":"IF(OR(EXTSELECT=2,Frame_Width<48,Frame_Height<84),0.0516,IF(OR(EXTSELECT=3,Frame_Width>48,Frame_Height>84),0.3784,0))","v":5.16E-2},-4.3000000000000003E-2,null,null,null,0,7,{"$f":"IF(AND(O7=7,$M$4>=4,$M$4<=4.99),O7&\"-\"&\"3\",0)","v":0},null,null,{"$error":"#N/A"},{"$error":"#N/A"},{"$f":"IF(AND(T7=7,$R$4>=4,$R$4<=4.99),T7&\"-\"&\"3\",0)","v":{"$error":"#N/A"}},null,null,null,8,4,"RD",null,null,{"$f":"HLOOKUP($AD$4,CALDWELL_LOOKUP,4,FALSE)","v":11},{"$f":"HLOOKUP($AE$4,CALDWELL_LOOKUP,4,FALSE)","v":12.999499999999999},10,9,null,11.766500000000001,13.766,11.218500000000001,13.218,11,12.999499999999999]
[null,"Bottom Stile Reinf.",0,null,0,null,"Top Stile Reinf",{"$f":"IF(OR(Frame_Width>48,Frame_Height>84,EXTTYPE=\"Steel\"),((TRUNC(((DDIM_3A01-1.625)-8)/2)*2)/12)*2,0)","v":0},0.45600000000000002,0,null,null,"Top Tube length",0,7,{"$f":"IF(AND(O8=7,$M$4>=5,$M$4<=5.99),O8&\"-\"&\"4\",0)","v":0},null,"Bott. Tube Length",{"$error":"#N/A"},{"$error":"#N/A"},{"$f":"IF(AND(T8=7,$R$4>=5,$R$4<=5.99),T8&\"-\"&\"4\",0)","v":{"$error":"#N/A"}},null,null,null,9,5,"BU",null,null,{"$f":"HLOOKUP($AD$4,CALDWELL_LOOKUP,5,FALSE)","v":13},{"$f":"HLOOKUP($AE$4,CALDWELL_LOOKUP,5,FALSE)","v":14.999499999999999},12,10,null,13.766500000000002,15.766000000000002,13.218500000000002,15.218000000000002,13,14.999499999999999]
[null,"Bottom Glass",{"$f":"(BGW_A571*BGH_A571)/144","v":9.1715494791666671E-2},{"$f":"GLASS_WGT","v":""},{"$f":"IF(AND(Frame_Width=35.5,Frame_Height=59.5),($C$9*$D$9)-2.25,$C$9*$D$9)","v":{"$error":"#VALUE!"}},null,"Top Glass",{"$f":"(TGW_3A01*TGH_3A01)/144","v":0.13118489583333334},{"$f":"GLASS_WGT","v":""},{"$f":"H9*I9","v":{"$error":"#VALUE!"}},null,null,{"$f":"TOPTUBELENGTH","v":0},0,7,{"$f":"IF(AND(O9=7,$M$4>=6,$M$4<=7.99),O9&\"-\"&\"5\",0)","v":0},null,{"$f":"BOTTUBELENGTH","v":{"$error":"#N/A"}},{"$error":"#N/A"},{"$error":"#N/A"},{"$f":"IF(AND(T9=7,$R$4>=6,$R$4<=7.99),T9&\"-\"&\"5\",0)","v":{"$error":"#N/A"}},null,null,null,10,5,"BU",null,null,{"$f":"HLOOKUP($AD$4,CALDWELL_LOOKUP,6,FALSE)","v":15.000000000000002},{"$f":"HLOOKUP($AE$4,CALDWELL_LOOKUP,6,FALSE)","v":16.999500000000001},14,12,null,15.766500000000001,17.766000000000002,15.218500000000001,17.218,15.000000000000002,16.999500000000001]
[null,"Bottom Spacer",{"$f":"((BGW_A571*2)+(BGH_A571*2))/12","v":-1.2291666666666667},5.3600000000000002E-2,-6.5883333333333335E-2,null,"Top Spacer",{"$f":"((TGW_3A01*2)+(TGH_3A01*2))/12","v":-1.5104166666666667},5.3600000000000002E-2,-8.095833333333334E-2,null,null,null,0,7,{"$f":"IF(AND(O10=7,$M$4>=8,$M$4<=9.99),O10&\"-\"&\"9\",0)","v":0},null,null,{"$error":"#N/A"},{"$error":"#N/A"},{"$f":"IF(AND(T10=7,$R$4>=8,$R$4<=9.99),T10&\"-\"&\"9\",0)","v":{"$error":"#N/A"}},null,null,null,11,6,"YW",null,null,{"$f":"HLOOKUP($AD$4,CALDWELL_LOOKUP,7,FALSE)","v":17},{"$f":"HLOOKUP($AE$4,CALDWELL_LOOKUP,7,FALSE)","v":18.999500000000001},16,14,null,17.766500000000001,19.766000000000002,17.218499999999999,19.218,17,18.999500000000001]
{"$rows_left_out":226}
{"sheet":"Tables","index":2,"n_rows":40,"n_cols":30,"rows_kept":40,"cut":false,"hidden":true,"merged":[[14,15,14,20]]}
[null,"S140 / S144 / S146 Calculations"]
[null,"Frame Cut Leg",{"$f":"LEG+6","v":6},null,null,null,"CDIM","DDIM","SashW","SashH","GlassW","GlassH","Radius","Weight","Deduct","Astragal","Screen W","Screen H","Balance",null,null,null,null,null,null,null,"Glass Strength"]
[null,"CMRD",{"$f":"Frame_Height-C2","v":-6},null,null,"Mezzo",{"$f":"CDIM_A140","v":0},{"$f":"DDIM_A140","v":6},{"$f":"BSW_03S0","v":-3.125},{"$f":"CDIM_A140-1.125","v":-1.125},{"$f":"I3-1.6875","v":-4.8125},{"$f":"J3-1.625","v":-2.75},12.5,{"$f":"BWGT_03S0","v":{"$error":"#VALUE!"}},0.26400000000000001,{"$f":"AST_03S0","v":-3.9375},{"$f":"Frame_Width-4.5","v":-4.5},{"$f":"CDIM_A140-1.3125","v":-1.3125},{"$f":"IF(ISERROR((VLOOKUP(BTM_WGT,CFB,2,FALSE))),\"N/A\",(VLOOKUP(BTM_WGT,CFB,2,FALSE)))","v":"N/A"},null,null,null,null,1,{"$f":"IF(AA3>\"\",VLOOKUP(AA3,GLASSLOOKUP,2,FALSE),\"\")","v":""},{"$f":"IF(AA3>\"\",VLOOKUP(Y3,WEIGHTCHART,2,FALSE),\"\")","v":""},{"$f":"GLASS1","v":""},null,null,"Extrusion"]
[null,"F",{"$f":"2*(ASIN((Offset*2)/(2*C10)))","v":{"$error":"#DIV/0!"}},null,null,"Mezzo/N.F",0,6,{"$f":"BSW_03S0","v":-3.125},{"$f":"CDIM_A140-1.125","v":-1.125},{"$f":"I4-1.6875","v":-4.8125},{"$f":"J4-1.625","v":-2.75},13,{"$f":"BWGT_03S0","v":{"$error":"#VALUE!"}},0.26400000000000001,{"$f":"AST_03S0","v":-3.9375},{"$f":"Frame_Width-4.5","v":-4.5},{"$f":"CDIM_A140-1.3125","v":-1.3125},{"$f":"IF(ISERROR((VLOOKUP(BTM_WGT,CFB,2,FALSE))),\"N/A\",(VLOOKUP(BTM_WGT,CFB,2,FALSE)))","v":"N/A"},null,null,null,null,2,"","",{"$f":"GLASS2","v":""},null,1,{"$f":"IF(EXT_1=0,\"\",EXT_1)","v":""}]
[null,"d",{"$f":"C10*COS(C4/2)","v":{"$error":"#DIV/0!"}},null,null,"Mezzo w/Stucco",0,6,{"$f":"BSW_03S0","v":-3.125},{"$f":"CDIM_A140-1.125","v":-1.125},{"$f":"Frame_Width-4","v":-4},{"$f":"CDIM_A140-1.5625","v":-1.5625},13.5,{"$f":"BWGT_03S0","v":{"$error":"#VALUE!"}},0.26400000000000001,{"$f":"AST_03S0","v":-3.9375},{"$f":"Frame_Width-4.5","v":-4.5},{"$f":"CDIM_A140-1.3125","v":-1.3125},{"$f":"IF(ISERROR((VLOOKUP(BTM_WGT,CFB,2,FALSE))),\"N/A\",(VLOOKUP(BTM_WGT,CFB,2,FALSE)))","v":"N/A"},null,null,null,null,3,"","",{"$f":"GLASS3","v":""},null,2,{"$f":"IF(EXT_2=0,\"\",EXT_2)","v":""}]
[null,"h",{"$f":"C10-C5","v":{"$error":"#DIV/0!"}},null,null,"80s 1-3/8\" NFS",0,6,{"$f":"BSW_A581","v":-2.8125},{"$f":"CDIM_A840-1.5","v":-1.5},{"$f":"I6-2.5625","v":-5.375},{"$f":"J6-2.5625","v":-4.0625},11.75,{"$f":"BWGT_A581","v":{"$error":"#VALUE!"}},0.71875,{"$f":"AST_A581","v":-2.0625},{"$f":"Frame_Width-2.375","v":-2.375},{"$f":"CDIM_A840-2","v":-2},{"$f":"IF(ISERROR(BTM_TUBE),\"N/A\",BTM_TUBE)","v":"N/A"},null,null,null,null,4,"","",{"$f":"GLASS4","v":""},null,3,{"$f":"IF(EXT_3=0,\"\",EXT_3)","v":""}]
[null,null,{"$f":"IF(OR(ModelNo=\"A146\",ModelNo=\"A746\",ModelNo=\"A846\"),((Frame_Height-LEG)/2)+(((Frame_Width*2)^2)/(8*(Frame_Height-LEG))),((Frame_Height-LEG)/2)+((Frame_Width^2)/(8*(Frame_Height-LEG))))","v":{"$error":"#DIV/0!"}},null,null,"80s 1\" NFS",0,6,{"$f":"BSW_A581","v":-2.8125},{"$f":"CDIM_A840-1.5","v":-1.5},{"$f":"I7-2.5625","v":-5.375},{"$f":"J7-2.5625","v":-4.0625},11.75,{"$f":"BWGT_A581","v":{"$error":"#VALUE!"}},0.71875,{"$f":"AST_A581","v":-2.0625},{"$f":"Frame_Width-2.375","v":-2.375},{"$f":"CDIM_A840-2","v":-2},"N/A",null,null,null,null,5,"","",{"$f":"GLASS5","v":""},null,4,{"$f":"IF(EXT_4=0,\"\",EXT_4)","v":""}]
[null,"Top Glass Width",{"$f":"TRUNC((Frame_Width-2*EXT)*16+0.5)/16","v":0},null,null,"80s Flush Fin",0,6,{"$f":"BSW_A581","v":-2.8125},{"$f":"CDIM_A840-1.5","v":-1.5},-5.375,-4.0625,11.75,{"$f":"BWGT_A581","v":{"$error":"#VALUE!"}},0.71875,{"$f":"AST_A581","v":-2.0625},{"$f":"Frame_Width-2.375","v":-2.375},{"$f":"CDIM_A840-2","v":-2},"N/A",null,null,null,null,6,"","",{"$f":"GLASS6","v":""},null,5,{"$f":"IF(EXT_5=0,\"\",EXT_5)","v":""}]
[null,"Top Glass Height",{"$f":"IF(OR(ModelNo=\"A146\",ModelNo=\"A746\",ModelNo=\"A846\"),Frame_Height-($C$15+$C$12+EXT+C6),Frame_Height-($C$15+C12+EXT))","v":0},null,null,"70s 1-3/8\" NFS",0,6,{"$f":"BSW_A571","v":-2.125},{"$f":"CDIM_A740-0.875","v":-0.875},{"$f":"I9-2.1875","v":-4.3125},-3.0625,11.75,{"$f":"BWGT_A571","v":{"$error":"#VALUE!"}},0.6875,{"$f":"AST_A571","v":-1.8125},{"$f":"Frame_Width-2.125","v":-2.125},{"$f":"CDIM_A740-1.8125","v":-1.8125},"N/A",null,null,null,null,7,"","",{"$f":"GLASS7","v":""},null,"EXTSELECT",1]
[null,"Glass R:",{"$f":"FrameR-EXT","v":{"$error":"#DIV/0!"}},null,null,"70s 7/8\" NFS",0,6,{"$f":"BSW_A571","v":-2.125},{"$f":"CDIM_A740-0.875","v":-0.875},-4.3125,-3.0625,11.75,{"$f":"BWGT_A571","v":{"$error":"#VALUE!"}},0.6875,{"$f":"AST_A571","v":-1.8125},{"$f":"Frame_Width-2.125","v":-2.125},{"$f":"CDIM_A740-1.8125","v":-1.8125},"N/A",null,null,null,null,8,"","",{"$f":"GLASS8","v":""},null,"EXT",{"$f":"Offset","v":0}]
{"$rows_left_out":31}
{"sheet":"Data","index":3,"n_rows":425,"n_cols":81,"rows_kept":425,"cut":false,"hidden":true,"merged":[]}
[null,"Model","Description","Value"]
[{"$f":"IF(ModelNo=B2,1,\"\")","v":""},"3A01","Top Sash Width",{"$f":"Frame_Width-4.125","v":-4.125},null,{"$f":"Model_Select","v":"Select Model"},"Models","Description","W cut-back","H-cut-back","Width","Height","Min W","Min H","Max W","Max H","Max UI","Type1","Type2","Type3","Type4","Screen1","Screen2","Screen3","Ext./Reinf.","Ext./Reinf.","Ext./Reinf.","Ext./Reinf.","Ext./Reinf.","Offset","Glass1","Glass2","Glass3","Glass4","Glass5","Glass6","Glass7","Glass8","Opening","CDIM","DDIM","TSW","TSH","TGW","TGH","TGSF","BSW","BSH","BGW","BGH","BGSF","Bott. Sash Weight","Top Sash Weight","Bot. of Coil From CMR","Head + 4.5","Sill + CMR","EW","EH",null,null,null,null,null,null,null,null,null,null,"Triple IG calculation",null,null,null,null,null,null,null,"S140 Limitations"]
[{"$f":"IF(ModelNo=B3,2,\"\")","v":""},"3A01","Top Sash Height",{"$f":"DDIM_3A01-1.625","v":-1.625},null,1,"Select Model"]
[{"$f":"IF(ModelNo=B4,3,\"\")","v":""},"3A01","Bottom Sash Width",{"$f":"Frame_Width-3.125","v":-3.125},null,2,"3A01","Montrose Double Hung",0,0,null,null,12,20,{"$f":"IF(EXTSELECT=2,48,IF(EXTSELECT=3,52,\"\"))","v":""},{"$f":"IF(EXTSELECT=2,84,IF(EXTSELECT=3,96,\"\"))","v":""},{"$f":"IF(EXTSELECT=2,126,IF(EXTSELECT=3,148,\"\"))","v":""},"Standard","Custom",null,{"$f":"IF(AND(W>0,H>0,BTYPE=\"Custom\",CMR=0),\"<< Enter CMR Location\",IF(AND(W>0,H>0,BTYPE=\"Custom\"),\"<< CMR, Bottom-Up\",\"\"))","v":""},"Half","Full","Locking","Select Reinforcement","Composite","Steel",null,null,null,"Single Strength (2.5 mm)","Double Strength (3 mm)","Triple Strength (5 mm)","Triple IG Single Strength","Triple IG Double Strength","Laminated",null,null,{"$f":"IF(RO=2,\"<< Exact Size Only\",\"\")","v":""},{"$f":"Frame_Height-DDIM_3A01","v":0},{"$f":"IF(TYPE=1,(Frame_Height/2),IF(TYPE=2,Frame_Height-CMR))","v":0},{"$f":"TSW_3A01","v":-4.125},{"$f":"TSH_3A01","v":-1.625},{"$f":"TGW_3A01","v":-5.8125},{"$f":"TGH_3A01","v":-3.25},{"$f":"(AR4*AS4)/144","v":0.13118489583333334},{"$f":"BSW_3A01","v":-3.125},{"$f":"BSH_3A01","v":-0.625},{"$f":"BGW_3A01","v":-4.8125},{"$f":"BGH_3A01","v":-2.25},{"$f":"(AW4*AX4)/144","v":7.51953125E-2},{"$f":"BWGT_3A01","v":{"$error":"#VALUE!"}},{"$f":"TWGT_3A01","v":{"$error":"#VALUE!"}},{"$f":"IF(COIL=1,3.875-0.6875,3.875+((COIL-1)*1.625)-0.6875)","v":{"$error":"#N/A"}},6,1.875,{"$f":"Frame_Width-5.25","v":-5.25},{"$f":"IF(AND(AV4>36.0625,(Frame_Height/2)<=CMR),CDIM_3A01-BD4-BB4-0.125,IF(OR(AND(AV4>36.0625,(Frame_Height/2)<=CMR),(Frame_Height/2)>=CMR),Frame_Height-AV4-BC4-BD4,CDIM_3A01-BD4-BB4-0.125))","v":-7.25},null,null,null,null,null,1,"Single Strength (2.5 mm)",null,null,null,"SS (2.2)","DS (3.2)","4 mm","TS (5.0)",null,null,null,null,"Min. W","Min. H","Max. W","Max. H","Max. UI"]
[{"$f":"IF(ModelNo=B5,4,\"\")","v":""},"3A01","Bottom Sash Height",{"$f":"CDIM_3A01-0.625","v":-0.625},null,3,"3A02","Montrose Two Lite Slider",0,0,null,null,18.5,11.25,{"$f":"IF(EXTSELECT=2,72,IF(EXTSELECT=3,96,\"\"))","v":""},{"$f":"IF(EXTSELECT=2,56,IF(EXTSELECT=3,72,\"\"))","v":""},{"$f":"IF(EXTSELECT=2,128,IF(EXTSELECT=3,156,\"\"))","v":""},"Standard",null,null,null,"Half","Full",null,"Select Reinforcement","Composite","Steel",null,null,null,"Single Strength (2.5 mm)","Double Strength (3 mm)","Triple Strength (5 mm)","Triple IG Single Strength","Triple IG Double Strength","Laminated",null,null,"",null,null,null,null,null,null,null,null,null,null,null,null,null,null,null,null,null,{"$f":"(Frame_Width/2)-4.75","v":-4.75},null,null,null,null,null,null,2,"Double Strength (3 mm)",null,null,"Max. Short",{"$f":"IF(TG2W>41,0,41)","v":41},{"$f":"IF(TG2W>56,0,56)","v":56},{"$f":"IF(TG2W>67,0,67)","v":67},{"$f":"IF(TG2W>70,0,70)","v":70},"Annealed",null,null,"Mezzo",25,40]
[{"$f":"IF(ModelNo=B6,5,\"\")","v":""},"3A01","Top Glass Width",{"$f":"TSW_3A01-1.6875","v":-5.8125},null,4,"3A03","Montrose Three Lite Slider (1/4-1/2-1/4)",0,0,null,null,47.5,11.25,{"$f":"IF(EXTSELECT=2,108,IF(EXTSELECT=3,120,\"\"))","v":""},{"$f":"IF(EXTSELECT=2,56,IF(EXTSELECT=3,72,\"\"))","v":""},{"$f":"IF(EXTSELECT=2,164,IF(EXTSELECT=3,192,\"\"))","v":""},"Standard (1/4-1/2-1/4)",null,null,null,"Half","Full",null,"Select Reinforcement","Composite","Steel",null,null,null,"Single Strength (2.5 mm)","Double Strength (3 mm)","Triple Strength (5 mm)","Triple IG Single Strength","Triple IG Double Strength","Laminated",null,null,"",null,null,null,null,null,null,null,null,null,null,null,null,null,null,null,null,null,{"$f":"(Frame_Width/4)-2.25","v":-2.25},null,null,null,null,null,null,3,"Triple Strength (5 mm)",null,null,"Max. Long",{"$f":"IF(TG2H>62,0,62)","v":62},{"$f":"IF(TG2H>76,0,76)","v":76},{"$f":"IF(TG2H>90,0,90)","v":90},{"$f":"IF(TG2H>102,0,102)","v":102},"Annealed",null,null,"Mezzo/N.F",26,41]
[{"$f":"IF(ModelNo=B7,6,\"\")","v":""},"3A01","Top Glass Height",{"$f":"TSH_3A01-1.625","v":-3.25},null,5,"3A04","Montrose Picture Window",0,0,null,null,9.5,9.5,120,120,180,"Standard",null,null,null,null,null,null,null,null,null,null,null,null,"Single Strength (2.5 mm)","Double Strength (3 mm)","Triple Strength (5 mm)","Triple IG Single Strength","Triple IG Double Strength","Laminated",null,null,"",null,null,null,null,null,null,null,null,null,null,null,null,null,null,null,null,null,null,null,null,null,null,null,null,4,"Triple IG Single Strrength",null,null,"Max Sq.Ft.",{"$f":"IF(TG2A>12,0,12)","v":12},{"$f":"IF(TG2A>22,0,22)","v":22},{"$f":"IF(TG2A>32,0,32)","v":32},{"$f":"IF(TG2A>35,0,35)","v":35},"Annealed",null,null,"New Construction",20,36]
[{"$f":"IF(ModelNo=B8,7,\"\")","v":""},"3A01","Bottom Glass Width",{"$f":"BSW_3A01-1.6875","v":-4.8125},null,6,"3A09","Montrose Three Lite Slider Equal Lite",0,0,null,null,37.25,11.25,{"$f":"IF(EXTSELECT=2,108,IF(EXTSELECT=3,130,\"\"))","v":""},{"$f":"IF(EXTSELECT=2,56,IF(EXTSELECT=3,72,\"\"))","v":""},{"$f":"IF(EXTSELECT=2,164,IF(EXTSELECT=3,192,\"\"))","v":""},"Standard (1/3-1/3-1/3)",null,null,null,"Half","Full",null,"Select Reinforcement","Composite","Steel",null,null,null,"Single Strength (2.5 mm)","Double Strength (3 mm)","Triple Strength (5 mm)","Triple IG Single Strength","Triple IG Double Strength","Laminated",null,null,"",null,null,null,null,null,null,null,null,null,null,null,null,null,null,null,null,null,{"$f":"(Frame_Width/3)-4.375","v":-4.375},null,null,null,null,null,null,5,"Triple IG Double Strength",null,null,"Max. Short",0,{"$f":"IF(TG2W>42,0,42)","v":42},{"$f":"IF(TG2W>70,0,70)","v":70},{"$f":"IF(TG2W>70,0,70)","v":70},"Tempered",null,null,"0700 Series",20,36]
[{"$f":"IF(ModelNo=B9,8,\"\")","v":""},"3A01","Bottom Glass Height",{"$f":"BSH_3A01-1.625","v":-2.25},null,7,"03S0","Montrose Single Hung",0,0,null,null,12,22,{"$f":"IF(EXTSELECT=2,48,IF(EXTSELECT=3,52,\"\"))","v":""},{"$f":"IF(EXTSELECT=2,78,IF(EXTSELECT=3,96,\"\"))","v":""},{"$f":"IF(EXTSELECT=2,126,IF(EXTSELECT=3,148,\"\"))","v":""},"Standard","Custom",null,{"$f":"IF(AND(W>0,H>0,BTYPE=\"Custom\",CMR=0),\"<< Enter CMR Location\",IF(AND(W>0,H>0,BTYPE=\"Custom\"),\"<< CMR, Bottom-Up\",\"\"))","v":""},"Half","Full","Locking","Select Reinforcement","Composite","Steel",null,null,null,"Single Strength (2.5 mm)","Double Strength (3 mm)","Triple Strength (5 mm)","Triple IG Single Strength","Triple IG Double Strength","Laminated",null,null,"",{"$f":"Frame_Height-DDIM_03S0","v":0},{"$f":"IF(TYPE=1,(Frame_Height/2),IF(TYPE=2,Frame_Height-CMR))","v":0},null,null,{"$f":"TGW_03S0","v":-4.6875},{"$f":"TGH_03S0","v":-2.59375},{"$f":"(AR9*AS9)/144","v":8.4431966145833329E-2},{"$f":"BSW_03S0","v":-3.125},{"$f":"BSH_03S0","v":-1.125},{"$f":"BGW_03S0","v":-4.8125},{"$f":"BGH_03S0","v":-2.75},{"$f":"(AW9*AX9)/144","v":9.1905381944444448E-2},{"$f":"BWGT_03S0","v":{"$error":"#VALUE!"}},null,{"$f":"IF(COIL=1,3.875-0.6875,3.875+((COIL-1)*1.625)-0.6875)","v":{"$error":"#N/A"}},6,1.875,{"$f":"Frame_Width-5.8125","v":-5.8125},{"$f":"IF(AND(AV9>36.0625,(Frame_Height/2)<=CMR),CDIM_03S0-BD9-BB9-0.125,IF(OR(AND(AV9>36.0625,(Frame_Height/2)<=CMR),(Frame_Height/2)>=CMR),Frame_Height-AV9-BC9-BD9,CDIM_03S0-BD9-BB9-0.125))","v":-6.75},null,null,null,null,null,6,"Laminated",null,null,"Max. Long",0,{"$f":"IF(TG2H>84,0,84)","v":84},{"$f":"IF(TG2H>129,0,129)","v":129},{"$f":"IF(TG2H>129,0,129)","v":129},"Tempered",null,null,"Fusion",23.5,38]
[{"$f":"IF(ModelNo=B10,9,\"\")","v":""},"3A01","Top Sash Stop Length",{"$f":"SASHSTOP3001","v":7},null,8,"03S2","Montrose Two Lite Single Slider",0,0,null,null,18.5,12,{"$f":"IF(EXTSELECT=2,72,IF(EXTSELECT=3,96,\"\"))","v":""},{"$f":"IF(EXTSELECT=2,56,IF(EXTSELECT=3,72,\"\"))","v":""},{"$f":"IF(EXTSELECT=2,128,IF(EXTSELECT=3,156,\"\"))","v":""},"Standard",null,null,null,"Half","Full",null,"Select Reinforcement","Composite","Steel",null,null,null,"Single Strength (2.5 mm)","Double Strength (3 mm)","Triple Strength (5 mm)","Triple IG Single Strength","Triple IG Double Strength","Laminated",null,null,"",null,null,null,null,null,null,null,null,null,null,null,null,null,null,null,null,null,null,null,null,null,null,null,null,7,"HP Package",null,null,"Max Sq.Ft.",0,{"$f":"IF(TG2A>24.5,0,24.5)","v":24.5},{"$f":"IF(TG2A>42,0,42)","v":42},{"$f":"IF(TG2A>42,0,42)","v":42},"Tempered",null,null,1700,24]
{"$rows_left_out":415}