{"text_format":"1","workbook":"xlsx","n_sheets":4,"sheets":["Form","Balance","Tables","Data"],"not_rendered":{"charts":0,"images":1,"macros":1,"external_links":1,"defined_names":329,"comments":1,"pivot_tables":0},"unopened":[],"bounds":{"document_bytes":16777216,"sheet_cells":100000,"rows_first":2000,"rows_last":500,"rows_between":2000,"halvings":0,"cell_chars":16384,"cell_head_chars":4096},"cells_cut":0,"cells_raw":0,"read":"whole","date_system":"1900"}

{"sheet":"Form","index":0,"n_rows":26,"n_cols":16,"rows_kept":26,"cut":false,"hidden":false,"merged":[[3,1,3,7],[3,9,3,12],[2,6,2,7],[2,1,2,5],[28,12,28,13],[25,12,25,13],[27,12,27,13],[26,12,26,13],[2,13,2,14],[3,13,3,14],[13,14,13,15],[17,13,18,15],[2,9,2,12],[6,14,6,15],[5,14,5,15]]}
[]
[null,{"$f":"IF(AND(WSIZE>0,HSIZE>0),\"Only Available At\"&\"  \"&WSIZE&\" x \"&HSIZE&IF(HCONTROL=1,\" or \"&HSIZE2,\"\"),\"\")","v":""},null,null,null,null,null,"Select Model",null,{"$f":"IF(ISERROR(SHATERROR),\"\",IF(SHATERROR=1,\"Adjust CMR to Increase Egress Height\",\"\"))","v":""}]
[null,{"$f":"IF(Model_Select=\"Select Model\",\"\",\"(Model\"&\" \"&ModelNo&\")\")","v":""},null,null,null,null,"Select Model",null,null,{"$f":"\"Min. W:\"&\" \"&MINW","v":"Min. W: 0"},null,null,null,{"$f":"\"Max W:\"&\" \"&MAXW","v":"Max W: 0"}]
[null,{"$f":"Description","v":0},null,null,null,null,null,null,null,{"$f":"\"Min. H:\"&\" \"&MINH","v":"Min. H: 0"},null,null,null,{"$f":"\"Max H:\"&\" \"&MAXH","v":"Max H: 0"},null,{"$f":"\"Max UI:\"&\" \"&MAXUI","v":"Max UI: 0"}]
[null,{"$f":"IF(AND(W>0,H>0),(IF(ISERROR(VLOOKUP(1,Data!$A:$D,3,FALSE)),\"\",VLOOKUP(1,Data!$A:$D,3,FALSE))),\"\")","v":""},null,null,null,{"$f":"IF(ISERROR(SHAT_MIN_R),\"\",IF(SHAT_MIN_R=1,SHAT_MESSAGE,\"\"))","v":""},null,{"$f":"IF(AND(W>0,H>0),(IF(ISERROR(VLOOKUP(1,Data!$A:$D,4,FALSE)),\"\",VLOOKUP(1,Data!$A:$D,4,FALSE))),\"\")","v":""},null,null,null,null,null,"Exact Size"]
[null,{"$f":"IF(AND(W>0,H>0),(IF(ISERROR(VLOOKUP(2,Data!$A:$D,3,FALSE)),\"\",VLOOKUP(2,Data!$A:$D,3,FALSE))),\"\")","v":""},null,null,null,null,null,{"$f":"IF(AND(W>0,H>0),(IF(ISERROR(VLOOKUP(2,Data!$A:$D,4,FALSE)),\"\",VLOOKUP(2,Data!$A:$D,4,FALSE))),\"\")","v":""},null,"Width:",null,null,null,{"$f":"IF(AND(RO=2,W>0),W-WCUTBACK,W)","v":0},{"$f":"IF(AND(W>0,WSIZE>0,W<>WSIZE),\"<< Width Not Available\",\"\")","v":""}]
[null,{"$f":"IF(AND(W>0,H>0),(IF(ISERROR(VLOOKUP(3,Data!$A:$D,3,FALSE)),\"\",VLOOKUP(3,Data!$A:$D,3,FALSE))),\"\")","v":""},null,null,null,null,null,{"$f":"IF(AND(W>0,H>0),(IF(ISERROR(VLOOKUP(3,Data!$A:$D,4,FALSE)),\"\",VLOOKUP(3,Data!$A:$D,4,FALSE))),\"\")","v":""},null,"Height:",null,null,null,{"$f":"IF(AND(RO=2,H>0),H-HCUTBACK,H)","v":0},{"$f":"IF(AND(H>0,HSIZE>0,HSIZE2>0,H<>HSIZE,H<>HSIZE2),\"<< Height Not Available\",\"\")","v":""}]
[null,{"$f":"IF(AND(W>0,H>0),(IF(ISERROR(VLOOKUP(4,Data!$A:$D,3,FALSE)),\"\",VLOOKUP(4,Data!$A:$D,3,FALSE))),\"\")","v":""},null,null,null,null,null,{"$f":"IF(AND(W>0,H>0),(IF(ISERROR(VLOOKUP(4,Data!$A:$D,4,FALSE)),\"\",VLOOKUP(4,Data!$A:$D,4,FALSE))),\"\")","v":""},null,{"$f":"IF(OR(ModelNo=\"S140\",ModelNo=\"S144\",ModelNo=\"S146\",ModelNo=\"S140 (HP)\",ModelNo=\"S144 (HP)\",ModelNo=\"S146 (HP)\"),\"Leg:\",\"\")","v":""},null,null,null,{"$f":"LEG_MESSAGE","v":""}]
[null,{"$f":"IF(AND(W>0,H>0),(IF(ISERROR(VLOOKUP(5,Data!$A:$D,3,FALSE)),\"\",VLOOKUP(5,Data!$A:$D,3,FALSE))),\"\")","v":""},null,null,null,null,null,{"$f":"IF(AND(W>0,H>0),(IF(ISERROR(VLOOKUP(5,Data!$A:$D,4,FALSE)),\"\",VLOOKUP(5,Data!$A:$D,4,FALSE))),\"\")","v":""},null,{"$f":"IF(BTYPE=\"Custom\",\"CMR:\",\"\")","v":""},null,null,null,{"$f":"CMR_MESSAGE","v":0}]
[null,{"$f":"IF(AND(W>0,H>0),(IF(ISERROR(VLOOKUP(6,Data!$A:$D,3,FALSE)),\"\",VLOOKUP(6,Data!$A:$D,3,FALSE))),\"\")","v":""},null,null,null,null,null,{"$f":"IF(AND(W>0,H>0),(IF(ISERROR(VLOOKUP(6,Data!$A:$D,4,FALSE)),\"\",VLOOKUP(6,Data!$A:$D,4,FALSE))),\"\")","v":""},null,{"$f":"IF(SELECTEXT=\"Select Extrusion\",\"Ext.\",IF(SELECTEXT=\"Select Reinforcement\",\"Reinforce\",IF(SELECTEXT=\"Standard\",\"HP >>\",\"\")))","v":""},null,null,null,{"$f":"EXT_MESSAGE","v":""}]
[null,{"$f":"IF(AND(W>0,H>0),(IF(ISERROR(VLOOKUP(7,Data!$A:$D,3,FALSE)),\"\",VLOOKUP(7,Data!$A:$D,3,FALSE))),\"\")","v":""},null,null,null,null,null,{"$f":"IF(AND(W>0,H>0),(IF(ISERROR(VLOOKUP(7,Data!$A:$D,4,FALSE)),\"\",VLOOKUP(7,Data!$A:$D,4,FALSE))),\"\")","v":""},null,"Opening:",null,null,null,{"$f":"RO_OPTION","v":0}]
[null,{"$f":"IF(AND(W>0,H>0),(IF(ISERROR(VLOOKUP(8,Data!$A:$D,3,FALSE)),\"\",VLOOKUP(8,Data!$A:$D,3,FALSE))),\"\")","v":""},null,null,null,null,null,{"$f":"IF(AND(W>0,H>0),(IF(ISERROR(VLOOKUP(8,Data!$A:$D,4,FALSE)),\"\",VLOOKUP(8,Data!$A:$D,4,FALSE))),\"\")","v":""},null,"Type:"]
[null,{"$f":"IF(AND(W>0,H>0),(IF(ISERROR(VLOOKUP(9,Data!$A:$D,3,FALSE)),\"\",VLOOKUP(9,Data!$A:$D,3,FALSE))),\"\")","v":""},null,null,null,null,null,{"$f":"IF(AND(W>0,H>0),(IF(ISERROR(VLOOKUP(9,Data!$A:$D,4,FALSE)),\"\",VLOOKUP(9,Data!$A:$D,4,FALSE))),\"\")","v":""},null,"Screen:"]
[null,{"$f":"IF(AND(W>0,H>0),(IF(ISERROR(VLOOKUP(10,Data!$A:$D,3,FALSE)),\"\",VLOOKUP(10,Data!$A:$D,3,FALSE))),\"\")","v":""},null,null,null,null,null,{"$f":"IF(AND(W>0,H>0),(IF(ISERROR(VLOOKUP(10,Data!$A:$D,4,FALSE)),\"\",VLOOKUP(10,Data!$A:$D,4,FALSE))),\"\")","v":""},null,"Glass:",null,null,null,null,{"$f":"IF(AND(EXTTYPE=\"HP Package\",GT=\"S\"),\"<< Must Select DS\",\"\")","v":""}]
[]
[null,{"$f":"IF(AND(W>0,H>0),(IF(ISERROR(VLOOKUP(11,Data!$A:$D,3,FALSE)),\"\",VLOOKUP(11,Data!$A:$D,3,FALSE))),\"\")","v":""},null,null,null,null,null,{"$f":"IF(AND(W>0,H>0),(IF(ISERROR(VLOOKUP(11,Data!$A:$D,4,FALSE)),\"\",VLOOKUP(11,Data!$A:$D,4,FALSE))),\"\")","v":""}]
[null,{"$f":"IF(AND(W>0,H>0),(IF(ISERROR(VLOOKUP(12,Data!$A:$D,3,FALSE)),\"\",VLOOKUP(12,Data!$A:$D,3,FALSE))),\"\")","v":""},null,null,null,null,null,{"$f":"IF(AND(W>0,H>0),(IF(ISERROR(VLOOKUP(12,Data!$A:$D,4,FALSE)),\"\",VLOOKUP(12,Data!$A:$D,4,FALSE))),\"\")","v":""}]
[null,{"$f":"IF(AND(W>0,H>0),(IF(ISERROR(VLOOKUP(13,Data!$A:$D,3,FALSE)),\"\",VLOOKUP(13,Data!$A:$D,3,FALSE))),\"\")","v":""},null,null,null,null,null,{"$f":"IF(AND(W>0,H>0),(IF(ISERROR(VLOOKUP(13,Data!$A:$D,4,FALSE)),\"\",VLOOKUP(13,Data!$A:$D,4,FALSE))),\"\")","v":""},null,null,null,null,null,"A Designated AC Sash is Used to Replace BOTH Top and Bottom Sashes When AC is in the Window"]
[null,{"$f":"IF(AND(W>0,H>0),(IF(ISERROR(VLOOKUP(14,Data!$A:$D,3,FALSE)),\"\",VLOOKUP(14,Data!$A:$D,3,FALSE))),\"\")","v":""},null,null,null,null,null,{"$f":"IF(AND(W>0,H>0),(IF(ISERROR(VLOOKUP(14,Data!$A:$D,4,FALSE)),\"\",VLOOKUP(14,Data!$A:$D,4,FALSE))),\"\")","v":""}]
[null,{"$f":"IF(AND(W>0,H>0),(IF(ISERROR(VLOOKUP(15,Data!$A:$D,3,FALSE)),\"\",VLOOKUP(15,Data!$A:$D,3,FALSE))),\"\")","v":""},null,null,null,null,null,{"$f":"IF(AND(W>0,H>0),(IF(ISERROR(VLOOKUP(15,Data!$A:$D,4,FALSE)),\"\",VLOOKUP(15,Data!$A:$D,4,FALSE))),\"\")","v":""},null,"AC Width: ",null,null,null,{"$f":"IF(AND(W>0,H>0,ACWIDTH>0,ACHEIGHT>0,ACCMR>0,ACLINK=TRUE),ACCMR,IF(AND(W>0,H>0,ACWIDTH>0,ACSASHW>0,ACLINK=TRUE),ACSASHW,\"\"))","v":""},{"$f":"IF(AND(W>0,H>0,ACWIDTH>0,ACHEIGHT>0,ACCMR>0,ACLINK=TRUE),\"<< CMR\",IF(AND(W>0,H>0,ACWIDTH>0,ACSASHW>0,ACLINK=TRUE),\"<< AC Sash Width\",\"\"))","v":""}]
[null,{"$f":"IF(AND(W>0,H>0),(IF(ISERROR(VLOOKUP(16,Data!$A:$D,3,FALSE)),\"\",VLOOKUP(16,Data!$A:$D,3,FALSE))),\"\")","v":""},null,null,null,null,null,{"$f":"IF(AND(W>0,H>0),(IF(ISERROR(VLOOKUP(16,Data!$A:$D,4,FALSE)),\"\",VLOOKUP(16,Data!$A:$D,4,FALSE))),\"\")","v":""},null,"AC Height: ",null,null,null,{"$f":"IF(AND(W>0,H>0,ACHEIGHT>0,ACSASHH>0,ACLINK=TRUE),ACSASHH,\"\")","v":""},{"$f":"IF(AND(ACCMR>0,ACLINK=TRUE),\"\",IF(AND(W>0,H>0,ACHEIGHT>0,ACSASHH>0,ACLINK=TRUE),\"<< AC Sash Height\",\"\"))","v":""}]
[null,{"$f":"IF(AND(W>0,H>0),(IF(ISERROR(VLOOKUP(17,Data!$A:$D,3,FALSE)),\"\",VLOOKUP(17,Data!$A:$D,3,FALSE))),\"\")","v":""},null,null,null,null,null,{"$f":"IF(AND(W>0,H>0),(IF(ISERROR(VLOOKUP(17,Data!$A:$D,4,FALSE)),\"\",VLOOKUP(17,Data!$A:$D,4,FALSE))),\"\")","v":""},null,{"$f":"IF(ISERROR(TSH),\"\",IF(LIMIT1>\"\",LIMIT1&IF(LIMIT2>\"\",\" & \"&LIMIT2,\"\"),\"\"))","v":""}]
[null,{"$f":"IF(AND(W>0,H>0),(IF(ISERROR(VLOOKUP(18,Data!$A:$D,3,FALSE)),\"\",VLOOKUP(18,Data!$A:$D,3,FALSE))),\"\")","v":""},null,null,null,null,null,{"$f":"IF(AND(W>0,H>0),(IF(ISERROR(VLOOKUP(18,Data!$A:$D,4,FALSE)),\"\",VLOOKUP(18,Data!$A:$D,4,FALSE))),\"\")","v":""}]
[null,{"$f":"IF(AND(W>0,H>0),(IF(ISERROR(VLOOKUP(19,Data!$A:$D,3,FALSE)),\"\",VLOOKUP(19,Data!$A:$D,3,FALSE))),\"\")","v":""},null,null,null,null,null,{"$f":"IF(AND(W>0,H>0),(IF(ISERROR(VLOOKUP(19,Data!$A:$D,4,FALSE)),\"\",VLOOKUP(19,Data!$A:$D,4,FALSE))),\"\")","v":""}]
[]
[null,null,{"$f":"IF(AND(W>0,H>0,ACWIDTH>ACSASHW,ACLINK=TRUE),\"AC Width is Larger Than The Sash Width\",\"\")","v":""}]

{"sheet":"Balance","index":1,"n_rows":235,"n_cols":40,"rows_kept":235,"cut":false,"hidden":true,"merged":[[31,34,31,35],[31,37,31,38],[0,14,0,18],[1,12,1,15],[1,17,1,20],[1,24,1,26]]}
[null,null,null,null,null,null,null,null,null,null,null,null,null,null,"BLOCK & TACKLE BALANCE CHART"]
[null,null,null,null,null,null,null,null,null,null,null,null,"TOP SASH",null,null,null,null,"BOTTOM SASH",null,null,null,null,null,null,"CFB"]
[null,"A571/A740","Length","Weight/ft","Weight",null,"3A01","Length","Weight/ft","Weight",null,null,"Sash Weight","Tube Length","Balance","Weight",null,"Sash Weight","Tube Length","Balance","Weight",null,null,{"$f":"VLOOKUP(BTM_WGT,CFB_W,3,FALSE)","v":{"$error":"#N/A"}},4,3,"BN",null,null,"Caldwell Balance Chart"]
[null,"Bottom Top Rail",{"$f":"(BSW_A571)/12","v":-0.17708333333333334},0.24299999999999999,{"$f":"C4*D4","v":-4.303125E-2},null,"Top Top Rail",{"$f":"(TSW_3A01)/12","v":-0.34375},0.29699999999999999,{"$f":"H4*I4","v":-0.10209375},null,null,{"$f":"TRUNC(TOP_WGT+GRID)","v":0},{"$f":"TOPTUBELENGTH","v":0},"Number","Range",null,{"$f":"TRUNC(BTM_WGT+GRID)","v":0},{"$f":"BOTTUBELENGTH","v":{"$error":"#N/A"}},"Number","Range",null,null,null,{"$f":"Y3+1","v":5},3,"BN",null,null,{"$f":"IF(OR(ModelNo=\"1700\",ModelNo=\"1720\",ModelNo=\"1730\"),1,IF(OR(ModelNo=\"1900\",ModelNo=\"1920\",ModelNo=\"1930\"),2,3))","v":3},{"$f":"IF(OR(ModelNo=\"1700\",ModelNo=\"1720\",ModelNo=\"1730\"),4,IF(OR(ModelNo=\"1900\",ModelNo=\"1920\",ModelNo=\"1930\"),5,6))","v":6},"Bott.","Top",null,1,4,2,5,3,6]
[null,"Bottom Bottom Rail",{"$f":"(BSW_A571)/12","v":-0.17708333333333334},0.216,-3.8249999999999999E-2,null,"Top Bottom Rail",{"$f":"(TSW_3A01)/12","v":-0.34375},0.28899999999999998,-9.9343749999999995E-2,null,null,"Balance Size",{"$f":"IF(AND(O5>0,P5>0),O5,0)","v":0},{"$f":"IF($N$4<=7,7,0)","v":7},{"$f":"IF(AND(O5=7,$M$4>=2,$M$4<=2.99),O5&\"-\"&\"1\",0)","v":0},null,"Balance Size",{"$f":"IF(AND(T5>0,U5>0),T5,0)","v":{"$error":"#N/A"}},{"$f":"IF($S$4<=7,7,0)","v":{"$error":"#N/A"}},{"$f":"IF(AND(T5=7,$R$4>=2,$R$4<=2.99),T5&\"-\"&\"1\",0)","v":{"$error":"#N/A"}},null,null,null,6,3,"BN",null,null,{"$f":"HLOOKUP($AD$4,CALDWELL_LOOKUP,2,FALSE)","v":9},{"$f":"HLOOKUP($AE$4,CALDWELL_LOOKUP,2,FALSE)","v":9.9994999999999994},8,7,null,9.7665000000000006,10.766,9.2185000000000006,10.218,9,9.9994999999999994]
[null,"Bottom Stile",{"$f":"((BSH_A581)*2)/12","v":-0.25},0.185,-4.6249999999999999E-2,null,"Top Stile",{"$f":"(2*TSH_3A01)/12","v":-0.27083333333333331},0.218,-5.9041666666666666E-2,null,null,{"$f":"VLOOKUP((MAX(N5:P235)),N5:P235,3,FALSE)","v":{"$error":"#N/A"}},0,7,{"$f":"IF(AND(O6=7,$M$4>=3,$M$4<=3.99),O6&\"-\"&\"2\",0)","v":0},null,{"$f":"VLOOKUP((MAX(S5:S235)),S5:U235,3,FALSE)","v":{"$error":"#N/A"}},{"$error":"#N/A"},{"$error":"#N/A"},{"$f":"IF(AND(T6=7,$R$4>=3,$R$4<=3.99),T6&\"-\"&\"2\",0)","v":{"$error":"#N/A"}},null,null,null,7,4,"RD",null,null,{"$f":"HLOOKUP($AD$4,CALDWELL_LOOKUP,3,FALSE)","v":10},{"$f":"HLOOKUP($AE$4,CALDWELL_LOOKUP,3,FALSE)","v":10.999499999999999},9,8,null,10.766500000000001,11.766,10.218500000000001,11.218,10,10.999499999999999]
[null,"Bottom Rail Reinf.",{"$f":"((C4*12)-3)/12","v":-0.42708333333333331},0.17199999999999999,-7.345833333333332E-2,null,"Keeper Rail Reinf.",{"$f":"(TRUNC(((Frame_Width-4.125)-6)/2)*2)/12","v":-0.83333333333333337},{"$f":"IF(OR(EXTSELECT=2,Frame_Width<48,Frame_Height<84),0.0516,IF(OR(EXTSELECT=3,Frame_Width>48,Frame_Height>84),0.3784,0))","v":5.16E-2},-4.3000000000000003E-2,null,null,null,0,7,{"$f":"IF(AND(O7=7,$M$4>=4,$M$4<=4.99),O7&\"-\"&\"3\",0)","v":0},null,null,{"$error":"#N/A"},{"$error":"#N/A"},{"$f":"IF(AND(T7=7,$R$4>=4,$R$4<=4.99),T7&\"-\"&\"3\",0)","v":{"$error":"#N/A"}},null,null,null,8,4,"RD",null,null,{"$f":"HLOOKUP($AD$4,CALDWELL_LOOKUP,4,FALSE)","v":11},{"$f":"HLOOKUP($AE$4,CALDWELL_LOOKUP,4,FALSE)","v":12.999499999999999},10,9,null,11.766500000000001,13.766,11.218500000000001,13.218,11,12.999499999999999]
[null,"Bottom Stile Reinf.",0,null,0,null,"Top Stile Reinf",{"$f":"IF(OR(Frame_Width>48,Frame_Height>84,EXTTYPE=\"Steel\"),((TRUNC(((DDIM_3A01-1.625)-8)/2)*2)/12)*2,0)","v":0},0.45600000000000002,0,null,null,"Top Tube length",0,7,{"$f":"IF(AND(O8=7,$M$4>=5,$M$4<=5.99),O8&\"-\"&\"4\",0)","v":0},null,"Bott. Tube Length",{"$error":"#N/A"},{"$error":"#N/A"},{"$f":"IF(AND(T8=7,$R$4>=5,$R$4<=5.99),T8&\"-\"&\"4\",0)","v":{"$error":"#N/A"}},null,null,null,9,5,"BU",null,null,{"$f":"HLOOKUP($AD$4,CALDWELL_LOOKUP,5,FALSE)","v":13},{"$f":"HLOOKUP($AE$4,CALDWELL_LOOKUP,5,FALSE)","v":14.999499999999999},12,10,null,13.766500000000002,15.766000000000002,13.218500000000002,15.218000000000002,13,14.999499999999999]
[null,"Bottom Glass",{"$f":"(BGW_A571*BGH_A571)/144","v":9.1715494791666671E-2},{"$f":"GLASS_WGT","v":""},{"$f":"IF(AND(Frame_Width=35.5,Frame_Height=59.5),($C$9*$D$9)-2.25,$C$9*$D$9)","v":{"$error":"#VALUE!"}},null,"Top Glass",{"$f":"(TGW_3A01*TGH_3A01)/144","v":0.13118489583333334},{"$f":"GLASS_WGT","v":""},{"$f":"H9*I9","v":{"$error":"#VALUE!"}},null,null,{"$f":"TOPTUBELENGTH","v":0},0,7,{"$f":"IF(AND(O9=7,$M$4>=6,$M$4<=7.99),O9&\"-\"&\"5\",0)","v":0},null,{"$f":"BOTTUBELENGTH","v":{"$error":"#N/A"}},{"$error":"#N/A"},{"$error":"#N/A"},{"$f":"IF(AND(T9=7,$R$4>=6,$R$4<=7.99),T9&\"-\"&\"5\",0)","v":{"$error":"#N/A"}},null,null,null,10,5,"BU",null,null,{"$f":"HLOOKUP($AD$4,CALDWELL_LOOKUP,6,FALSE)","v":15.000000000000002},{"$f":"HLOOKUP($AE$4,CALDWELL_LOOKUP,6,FALSE)","v":16.999500000000001},14,12,null,15.766500000000001,17.766000000000002,15.218500000000001,17.218,15.000000000000002,16.999500000000001]
[null,"Bottom Spacer",{"$f":"((BGW_A571*2)+(BGH_A571*2))/12","v":-1.2291666666666667},5.3600000000000002E-2,-6.5883333333333335E-2,null,"Top Spacer",{"$f":"((TGW_3A01*2)+(TGH_3A01*2))/12","v":-1.5104166666666667},5.3600000000000002E-2,-8.095833333333334E-2,null,null,null,0,7,{"$f":"IF(AND(O10=7,$M$4>=8,$M$4<=9.99),O10&\"-\"&\"9\",0)","v":0},null,null,{"$error":"#N/A"},{"$error":"#N/A"},{"$f":"IF(AND(T10=7,$R$4>=8,$R$4<=9.99),T10&\"-\"&\"9\",0)","v":{"$error":"#N/A"}},null,null,null,11,6,"YW",null,null,{"$f":"HLOOKUP($AD$4,CALDWELL_LOOKUP,7,FALSE)","v":17},{"$f":"HLOOKUP($AE$4,CALDWELL_LOOKUP,7,FALSE)","v":18.999500000000001},16,14,null,17.766500000000001,19.766000000000002,17.218499999999999,19.218,17,18.999500000000001]
[null,"Bottom Hardware",1,0.36,0.36,null,"Top Hardware",1,0.4,0.4,null,null,null,0,7,{"$f":"IF(AND(O11=7,$M$4>=10,$M$4<=13.99),O11&\"-\"&\"11\",0)","v":0},null,null,{"$error":"#N/A"},{"$error":"#N/A"},{"$f":"IF(AND(T11=7,$R$4>=10,$R$4<=13.99),T11&\"-\"&\"11\",0)","v":{"$error":"#N/A"}},null,null,null,12,6,"YW",null,null,{"$f":"HLOOKUP($AD$4,CALDWELL_LOOKUP,8,FALSE)","v":19},{"$f":"HLOOKUP($AE$4,CALDWELL_LOOKUP,8,FALSE)","v":20.999500000000001},18,16,null,19.766500000000001,21.766000000000002,19.218499999999999,21.218,19,20.999500000000001]
[null,"Bottom Bead",{"$f":"(((Frame_Width-4)*2)+((CDIM_A571-2.75)*2))/12","v":-1.125},1.9E-2,-2.1374999999999998E-2,null,"Top Bead",{"$f":"(((Frame_Width-5.125)*2)+((DDIM_3A01-4.3125)*2))/12","v":-1.5729166666666667},7.1999999999999995E-2,-0.11325,null,null,null,0,7,{"$f":"IF(AND(O12=7,$M$4>=14,$M$4<=18),O12&\"-\"&\"12\",0)","v":0},null,null,{"$error":"#N/A"},{"$error":"#N/A"},{"$f":"IF(AND(T12=7,$R$4>=14,$R$4<=18),T12&\"-\"&\"12\",0)","v":{"$error":"#N/A"}},null,null,null,13,7,"GN",null,null,{"$f":"HLOOKUP($AD$4,CALDWELL_LOOKUP,9,FALSE)","v":21},{"$f":"HLOOKUP($AE$4,CALDWELL_LOOKUP,9,FALSE)","v":22.999500000000001},20,18,null,21.766500000000001,23.766000000000002,21.218499999999999,23.218,21,22.999500000000001]
[null,null,null,"Bottom Sash",{"$f":"TRUNC(SUM(E4:E12)+GRID)","v":{"$error":"#VALUE!"}},null,"Bottom Top Rail",{"$f":"BSW_3A01/12","v":-0.26041666666666669},0.29699999999999999,-7.7343750000000003E-2,null,null,null,0,{"$f":"IF(AND($N$4<=9,$N$4>7),9,0)","v":0},{"$f":"IF(AND(O13=9,$M$4>=3,$M$4<=4.99),O13&\"-\"&\"1\",0)","v":0},null,null,{"$error":"#N/A"},{"$f":"IF(AND($S$4<=9,$S$4>7),9,0)","v":{"$error":"#N/A"}},{"$f":"IF(AND(T13=9,$R$4>=3,$R$4<=4.99),T13&\"-\"&\"1\",0)","v":{"$error":"#N/A"}},null,null,null,14,7,"GN",null,null,{"$f":"HLOOKUP($AD$4,CALDWELL_LOOKUP,10,FALSE)","v":23},{"$f":"HLOOKUP($AE$4,CALDWELL_LOOKUP,10,FALSE)","v":24.999500000000001},22,20,null,23.766500000000001,25.766000000000002,23.218499999999999,25.218,23,24.999500000000001]
[null,null,null,null,null,null,"Bottom Bottom Rail",{"$f":"BSW_3A01/12","v":-0.26041666666666669},0.23200000000000001,-6.0416666666666674E-2,null,null,null,0,0,{"$f":"IF(AND(O14=9,$M$4>=5,$M$4<=6.99),O14&\"-\"&\"2\",0)","v":0},null,null,{"$error":"#N/A"},{"$error":"#N/A"},{"$f":"IF(AND(T14=9,$R$4>=5,$R$4<=6.99),T14&\"-\"&\"2\",0)","v":{"$error":"#N/A"}},null,null,null,15,8,"LG",null,null,{"$f":"HLOOKUP($AD$4,CALDWELL_LOOKUP,11,FALSE)","v":25},{"$f":"HLOOKUP($AE$4,CALDWELL_LOOKUP,11,FALSE)","v":26.999500000000001},24,22,null,25.766500000000001,27.766000000000002,25.218499999999999,27.218,25,26.999500000000001]
[null,"A581/A840","Length","Weight/ft","Weight",null,"Bottom Stile",{"$f":"IF(OR(Frame_Width>48,Frame_Height>84,EXTTYPE=\"Steel\"),((TRUNC((CDIM3A01-2)/2)*2)/12)*2,0)","v":0},0.219,0,null,null,null,0,0,{"$f":"IF(AND(O15=9,$M$4>=7,$M$4<=8.99),O15&\"-\"&\"3\",0)","v":0},null,null,{"$error":"#N/A"},{"$error":"#N/A"},{"$f":"IF(AND(T15=9,$R$4>=7,$R$4<=8.99),T15&\"-\"&\"3\",0)","v":{"$error":"#N/A"}},null,null,null,16,8,"LG",null,null,{"$f":"HLOOKUP($AD$4,CALDWELL_LOOKUP,12,FALSE)","v":27},{"$f":"HLOOKUP($AE$4,CALDWELL_LOOKUP,12,FALSE)","v":28.999500000000001},26,24,null,27.766500000000001,29.766000000000002,27.218499999999999,29.218,27,28.999500000000001]
[null,"Bottom Top Rail",{"$f":"BSW_A581/12","v":-0.234375},0.35499999999999998,{"$f":"C16*D16","v":-8.3203124999999989E-2},null,"Bottom Rail Reinf.",{"$f":"(TRUNC((BSW_3A01-6)/2)*2)/12","v":-0.66666666666666663},{"$f":"IF(OR(EXTSELECT=2,Frame_Width<48,Frame_Height<84),0.0516,IF(OR(EXTSELECT=3,Frame_Width>48,Frame_Height>84),0.57,0))","v":5.16E-2},-3.44E-2,null,null,null,0,0,{"$f":"IF(AND(O16=9,$M$4>=9,$M$4<=10.99),O16&\"-\"&\"4\",0)","v":0},null,null,{"$error":"#N/A"},{"$error":"#N/A"},{"$f":"IF(AND(T16=9,$R$4>=9,$R$4<=10.99),T16&\"-\"&\"4\",0)","v":{"$error":"#N/A"}},null,null,null,17,9,"NAT",null,null,{"$f":"HLOOKUP($AD$4,CALDWELL_LOOKUP,13,FALSE)","v":29},{"$f":"HLOOKUP($AE$4,CALDWELL_LOOKUP,13,FALSE)","v":30.999500000000001},28,26,null,29.766499999999997,31.765999999999998,29.218499999999995,31.217999999999996,29,30.999500000000001]
[null,"Bottom Bottom Rail",{"$f":"BSW_A581/12","v":-0.234375},0.35499999999999998,-8.3203124999999989E-2,null,"Bottom Stile Reinf.",{"$f":"IF(OR(Frame_Width>48,Frame_Height>84,EXTTYPE=\"Steel\"),((TRUNC((CDIM_3A01-2)/2)*2)/12)*2,0)","v":0},0.45600000000000002,0,null,null,null,0,0,{"$f":"IF(AND(O17=9,$M$4>=11,$M$4<=11.99),O17&\"-\"&\"5\",0)","v":0},null,null,{"$error":"#N/A"},{"$error":"#N/A"},{"$f":"IF(AND(T17=9,$R$4>=11,$R$4<=11.99),T17&\"-\"&\"5\",0)","v":{"$error":"#N/A"}},null,null,null,18,9,"NAT",null,null,{"$f":"HLOOKUP($AD$4,CALDWELL_LOOKUP,14,FALSE)","v":30.999999999999996},{"$f":"HLOOKUP($AE$4,CALDWELL_LOOKUP,14,FALSE)","v":32.999499999999998},30,28,null,31.766500000000001,33.765999999999998,31.218499999999999,33.217999999999996,30.999999999999996,32.999499999999998]
[null,"Bottom Stile",{"$f":"(BSH_A581*2)/12","v":-0.25},0.36099999999999999,-9.0249999999999997E-2,null,"Bottom Glass",{"$f":"(BGW_3A01*BGH_3A01)/144","v":7.51953125E-2},{"$f":"GLASS_WGT","v":""},{"$error":"#VALUE!"},null,null,null,0,0,{"$f":"IF(AND(O18=9,$M$4>=12,$M$4<=12.99),O18&\"-\"&\"6\",0)","v":0},null,null,{"$error":"#N/A"},{"$error":"#N/A"},{"$f":"IF(AND(T18=9,$R$4>=12,$R$4<=12.99),T18&\"-\"&\"6\",0)","v":{"$error":"#N/A"}},null,null,null,19,10,"PK",null,null,{"$f":"HLOOKUP($AD$4,CALDWELL_LOOKUP,15,FALSE)","v":33},{"$f":"HLOOKUP($AE$4,CALDWELL_LOOKUP,15,FALSE)","v":34.999499999999998},32,30,null,33.766500000000001,35.765999999999998,33.218499999999999,35.217999999999996,33,34.999499999999998]
[null,"Bottom Rail Reinf.",{"$f":"((C16*12)-2.6875)/12","v":-0.45833333333333331},0.13800000000000001,-6.3250000000000001E-2,null,"Bottom Spacer",{"$f":"((BGW_3A01*2)+(BGH_3A01*2))/12","v":-1.1770833333333333},5.3600000000000002E-2,-6.3091666666666671E-2,null,null,null,0,0,{"$f":"IF(AND(O19=9,$M$4>=13,$M$4<=14.99),O19&\"-\"&\"9\",0)","v":0},null,null,{"$error":"#N/A"},{"$error":"#N/A"},{"$f":"IF(AND(T19=9,$R$4>=13,$R$4<=14.99),T19&\"-\"&\"9\",0)","v":{"$error":"#N/A"}},null,null,null,20,10,"PK",null,null,{"$f":"HLOOKUP($AD$4,CALDWELL_LOOKUP,16,FALSE)","v":35},{"$f":"HLOOKUP($AE$4,CALDWELL_LOOKUP,16,FALSE)","v":36.999499999999998},34,32,null,35.766500000000001,37.765999999999998,35.218499999999999,37.217999999999996,35,36.999499999999998]
[null,"Bottom Stile Reinf.",0,0,0,null,"Bottom Hardware",1,0.36,0.36,null,null,null,0,0,{"$f":"IF(AND(O20=9,$M$4>=15,$M$4<=17.99),O20&\"-\"&\"11\",0)","v":0},null,null,{"$error":"#N/A"},{"$error":"#N/A"},{"$f":"IF(AND(T20=9,$R$4>=15,$R$4<=17.99),T20&\"-\"&\"11\",0)","v":{"$error":"#N/A"}},null,null,null,21,"11","BU",null,null,{"$f":"HLOOKUP($AD$4,CALDWELL_LOOKUP,17,FALSE)","v":37},{"$f":"HLOOKUP($AE$4,CALDWELL_LOOKUP,17,FALSE)","v":38.999499999999998},36,34,null,37.766500000000001,39.765999999999998,37.218499999999999,39.217999999999996,37,38.999499999999998]
[null,"Bottom Glass",{"$f":"(BGW_A581*BGH_A581)/144","v":0.1516384548611111},{"$f":"GLASS_WGT","v":""},{"$error":"#VALUE!"},null,"Bottom Bead",{"$f":"(((Frame_Width-4.125)*2)+((CDIM_3A01-3.3125)*2))/12","v":-1.2395833333333333},7.1999999999999995E-2,-8.9249999999999982E-2,null,null,null,0,0,{"$f":"IF(AND(O21=9,$M$4>=18,$M$4<=22),O21&\"-\"&\"12\",0)","v":0},null,null,{"$error":"#N/A"},{"$error":"#N/A"},{"$f":"IF(AND(T21=9,$R$4>=18,$R$4<=22),T21&\"-\"&\"12\",0)","v":{"$error":"#N/A"}},null,null,null,22,"11","BU",null,null,{"$f":"HLOOKUP($AD$4,CALDWELL_LOOKUP,18,FALSE)","v":39},{"$f":"HLOOKUP($AE$4,CALDWELL_LOOKUP,18,FALSE)","v":40.999499999999998},38,36,null,39.766500000000001,41.765999999999998,39.218499999999999,41.217999999999996,39,40.999499999999998]
[null,"Bottom Spacer",{"$f":"((BGW_A581*2)+(BGH_A581*2))/12","v":-1.5729166666666667},5.3600000000000002E-2,-8.4308333333333346E-2,null,null,null,"Top Sash",{"$f":"TRUNC(SUM(J4:J12)+1+GRID)","v":{"$error":"#VALUE!"}},null,null,null,0,{"$f":"IF(AND($N$4<=11,$N$4>9),11,0)","v":0},{"$f":"IF(AND(O22=11,$M$4>=3,$M$4<=4.99),O22&\"-\"&\"1\",0)","v":0},null,null,{"$error":"#N/A"},{"$f":"IF(AND($S$4<=11,$S$4>9),11,0)","v":{"$error":"#N/A"}},{"$f":"IF(AND(T22=11,$R$4>=3,$R$4<=4.99),T22&\"-\"&\"1\",0)","v":{"$error":"#N/A"}},null,null,null,23,"6/6","YW",null,null,{"$f":"HLOOKUP($AD$4,CALDWELL_LOOKUP,19,FALSE)","v":41},{"$f":"HLOOKUP($AE$4,CALDWELL_LOOKUP,19,FALSE)","v":42.999499999999998},40,38,null,41.766500000000001,43.765999999999998,41.218499999999999,43.217999999999996,41,42.999499999999998]
[null,"Bottom Hardware",1,0.36,0.36,null,null,null,"Bottom Sash",{"$f":"TRUNC(SUM(J13:J21)+GRID)","v":{"$error":"#VALUE!"}},null,null,null,0,0,{"$f":"IF(AND(O23=11,$M$4>=5,$M$4<=6.99),O23&\"-\"&\"2\",0)","v":0},null,null,{"$error":"#N/A"},{"$error":"#N/A"},{"$f":"IF(AND(T23=11,$R$4>=5,$R$4<=6.99),T23&\"-\"&\"2\",0)","v":{"$error":"#N/A"}},null,null,null,24,"6/6","YW",null,null,{"$f":"HLOOKUP($AD$4,CALDWELL_LOOKUP,20,FALSE)","v":43},{"$f":"HLOOKUP($AE$4,CALDWELL_LOOKUP,20,FALSE)","v":44.999499999999998},42,40,null,43.766500000000001,45.765999999999998,43.218499999999999,45.217999999999996,43,44.999499999999998]
[null,"Bottom Bead",{"$f":"(((Frame_Width-5.0625)*2)+((CDIM_A581-3.75)*2))/12","v":-1.46875},1.9E-2,-2.790625E-2,null,null,null,null,null,null,null,null,0,0,{"$f":"IF(AND(O24=11,$M$4>=7,$M$4<=8.99),O24&\"-\"&\"3\",0)","v":0},null,null,{"$error":"#N/A"},{"$error":"#N/A"},{"$f":"IF(AND(T24=11,$R$4>=7,$R$4<=8.99),T24&\"-\"&\"3\",0)","v":{"$error":"#N/A"}},null,null,null,25,"6/7","GN",null,null,{"$f":"HLOOKUP($AD$4,CALDWELL_LOOKUP,21,FALSE)","v":45},{"$f":"HLOOKUP($AE$4,CALDWELL_LOOKUP,21,FALSE)","v":46.999499999999998},44,42,null,45.766500000000001,47.765999999999998,45.218499999999999,47.217999999999996,45,46.999499999999998]
[null,null,null,"Bottom Sash",{"$f":"TRUNC(SUM(E16:E24)+GRID)","v":{"$error":"#VALUE!"}},null,"03S0",null,null,null,null,null,null,0,0,{"$f":"IF(AND(O25=11,$M$4>=9,$M$4<=10.99),O25&\"-\"&\"4\",0)","v":0},null,null,{"$error":"#N/A"},{"$error":"#N/A"},{"$f":"IF(AND(T25=11,$R$4>=9,$R$4<=10.99),T25&\"-\"&\"4\",0)","v":{"$error":"#N/A"}},null,null,null,26,"6/7","GN",null,null,{"$f":"HLOOKUP($AD$4,CALDWELL_LOOKUP,22,FALSE)","v":47},{"$f":"HLOOKUP($AE$4,CALDWELL_LOOKUP,22,FALSE)","v":48.999499999999998},46,44,null,47.766500000000001,49.765999999999998,47.218499999999999,49.217999999999996,47,48.999499999999998]
[null,null,null,null,null,null,"Bottom Top Rail",{"$f":"BSW_03S0/12","v":-0.26041666666666669},0.29699999999999999,{"$f":"H26*I26","v":-7.7343750000000003E-2},null,null,null,0,0,{"$f":"IF(AND(O26=11,$M$4>=11,$M$4<=12.99),O26&\"-\"&\"5\",0)","v":0},null,null,{"$error":"#N/A"},{"$error":"#N/A"},{"$f":"IF(AND(T26=11,$R$4>=11,$R$4<=12.99),T26&\"-\"&\"5\",0)","v":{"$error":"#N/A"}},null,null,null,27,"7/7","LG"]
[null,null,null,null,null,null,"Bottom Bottom Rail",{"$f":"BSW_03S0/12","v":-0.26041666666666669},0.23200000000000001,{"$f":"H27*I27","v":-6.0416666666666674E-2},null,null,null,0,0,{"$f":"IF(AND(O27=11,$M$4>=13,$M$4<=15.99),O27&\"-\"&\"6\",0)","v":0},null,null,{"$error":"#N/A"},{"$error":"#N/A"},{"$f":"IF(AND(T27=11,$R$4>=13,$R$4<=15.99),T27&\"-\"&\"6\",0)","v":{"$error":"#N/A"}},null,null,null,28,"7/7","LG"]
[null,"7SH2","Length","Weight/ft","Weight",null,"Bottom Stile",{"$f":"(BSH_03S0*2)/12","v":-0.1875},0.219,-4.1062500000000002E-2,null,null,null,0,0,{"$f":"IF(AND(O28=11,$M$4>=16,$M$4<=19.99),O28&\"-\"&\"9\",0)","v":0},null,null,{"$error":"#N/A"},{"$error":"#N/A"},{"$f":"IF(AND(T28=11,$R$4>=16,$R$4<=19.99),T28&\"-\"&\"9\",0)","v":{"$error":"#N/A"}},null,null,null,29,"7/8","OR",null,null,"Tube Length"]
[null,"Bottom Top Rail",{"$f":"BSW_7SH2/12","v":-0.1484375},0.24299999999999999,{"$f":"C29*D29","v":-3.60703125E-2},null,"Bottom Rail Reinf.",{"$f":"(2*(CDIM_03S0-1.125))/12","v":-0.1875},5.16E-2,-9.6749999999999996E-3,null,null,null,0,0,{"$f":"IF(AND(O29=11,$M$4>=20,$M$4<=23.99),O29&\"-\"&\"11\",0)","v":0},null,null,{"$error":"#N/A"},{"$error":"#N/A"},{"$f":"IF(AND(T29=11,$R$4>=20,$R$4<=23.99),T29&\"-\"&\"11\",0)","v":{"$error":"#N/A"}},null,null,null,30,"7/8","OR",null,null,"A571",{"$f":"VLOOKUP(BTM_WGT,CALDWELL_A571,4)","v":{"$error":"#N/A"}}]
[null,"Bottom Bottom Rail",{"$f":"BSW_7SH2/12","v":-0.1484375},0.216,-3.2062500000000001E-2,null,"Bottom Stile Reinf.",{"$f":"IF(OR(Frame_Width>48,Frame_Height>84,EXTTYPE=\"Steel\"),((TRUNC(((CDIM03S0-1.125)-4)/2)*2)/12)*2,0)","v":0},0.45600000000000002,0,null,null,null,0,0,{"$f":"IF(AND(O30=11,$M$4>=24,$M$4<=27),O30&\"-\"&\"12\",0)","v":0},null,null,{"$error":"#N/A"},{"$error":"#N/A"},{"$f":"IF(AND(T30=11,$R$4>=24,$R$4<=27),T30&\"-\"&\"12\",0)","v":{"$error":"#N/A"}},null,null,null,31,"8/8","WT",null,null,"A581",{"$f":"VLOOKUP(BTM_WGT,CALDWELL_A581,4)","v":{"$error":"#N/A"}}]
[null,"Bottom Stile",{"$f":"(BSH_7SH2*2)/12","v":-0.14583333333333334},0.186,-2.7125E-2,null,"Bottom Glass",{"$f":"(BGW_03S0*BGH_03S0)/144","v":9.1905381944444448E-2},{"$f":"GLASS_WGT","v":""},{"$error":"#VALUE!"},null,null,null,0,{"$f":"IF(AND($N$4<=13,$N$4>11),13,0)","v":0},{"$f":"IF(AND(O31=13,$M$4>=3,$M$4<=4.99),O31&\"-\"&\"1\",0)","v":0},null,null,{"$error":"#N/A"},{"$f":"IF(AND($S$4<=13,$S$4>11),13,0)","v":{"$error":"#N/A"}},{"$f":"IF(AND(T31=13,$R$4>=3,$R$4<=4.99),T31&\"-\"&\"1\",0)","v":{"$error":"#N/A"}},null,null,null,32,"8/8","WT",null,null,"7SH2",{"$f":"VLOOKUP(BTM_WGT,CALDWELL_A571,4)","v":{"$error":"#N/A"}}]
[null,"Bottom Rail Reinf.",{"$f":"(BSW_7SH2-3)/12","v":-0.3984375},0.17199999999999999,-6.8531249999999988E-2,null,"Bottom Spacer",{"$f":"((BGW_03S0*2)+(BGH_03S0*2))/12","v":-1.2604166666666667},5.3600000000000002E-2,-6.7558333333333345E-2,null,null,null,0,0,{"$f":"IF(AND(O32=13,$M$4>=5,$M$4<=7.99),O32&\"-\"&\"2\",0)","v":0},null,null,{"$error":"#N/A"},{"$error":"#N/A"},{"$f":"IF(AND(T32=13,$R$4>=5,$R$4<=7.99),T32&\"-\"&\"2\",0)","v":{"$error":"#N/A"}},null,null,null,33,"8/9","NAT",null,null,"7SH3",{"$f":"VLOOKUP(BTM_WGT,CALDWELL_A571,4)","v":{"$error":"#N/A"}},null,null,null,"Sash Height",null,"Balance ","Window Height 50/50 Split",null,"Oriel LBML"]
[null,"Bottom Stile Reinf.",null,null,0,null,"Bottom Hardware",1,0.36,0.36,null,null,null,0,0,{"$f":"IF(AND(O33=13,$M$4>=8,$M$4<=9.99),O33&\"-\"&\"3\",0)","v":0},null,null,{"$error":"#N/A"},{"$error":"#N/A"},{"$f":"IF(AND(T33=13,$R$4>=8,$R$4<=9.99),T33&\"-\"&\"3\",0)","v":{"$error":"#N/A"}},null,null,null,34,"8/9","NAT",null,null,"8SH2",{"$f":"VLOOKUP(BTM_WGT,CALDWELL_A581,4)","v":{"$error":"#N/A"}},null,null,null,"Min Height"," Max Height","Size","Min Height"," Max Height","from Bot of Sill"]
[null,"Bottom Glass",{"$f":"(BGW_7SH2*BGH_7SH2)/144","v":8.4404839409722224E-2},{"$f":"GLASS_WGT","v":""},{"$error":"#VALUE!"},null,"Bottom Bead",{"$f":"(((Frame_Width-4.125)*2)+((CDIM_03S0-3.3125)*2))/12","v":-1.2395833333333333},7.1999999999999995E-2,-8.9249999999999982E-2,null,null,null,0,0,{"$f":"IF(AND(O34=13,$M$4>=10,$M$4<=12.99),O34&\"-\"&\"4\",0)","v":0},null,null,{"$error":"#N/A"},{"$error":"#N/A"},{"$f":"IF(AND(T34=13,$R$4>=10,$R$4<=12.99),T34&\"-\"&\"4\",0)","v":{"$error":"#N/A"}},null,null,null,35,"9/9","PU",null,null,"8SH3",{"$f":"VLOOKUP(BTM_WGT,CALDWELL_A581,4)","v":{"$error":"#N/A"}}]
[null,"Bottom Spacer",{"$f":"((BGW_7SH2*2)+(BGH_7SH2*2))/12","v":-1.171875},5.3600000000000002E-2,-6.2812500000000007E-2,null,null,null,"Bott. Sash",{"$f":"TRUNC(SUM(J26:J34)+GRID)","v":{"$error":"#VALUE!"}},null,null,null,0,0,{"$f":"IF(AND(O35=13,$M$4>=13,$M$4<=15.99),O35&\"-\"&\"5\",0)","v":0},null,null,{"$error":"#N/A"},{"$error":"#N/A"},{"$f":"IF(AND(T35=13,$R$4>=13,$R$4<=15.99),T35&\"-\"&\"5\",0)","v":{"$error":"#N/A"}},null,null,null,36,"9/9","PU",null,null,"A740",{"$f":"VLOOKUP(BTM_WGT,CALDWELL_A571,4)","v":{"$error":"#N/A"}},null,null,null,9.7665000000000006,10.766,8,21.125,23.123999999999999,20.283000000000001]
[null,"Bottom Hardware",1,0.36,0.36,null,null,null,null,null,null,null,null,0,0,{"$f":"IF(AND(O36=13,$M$4>=16,$M$4<=18.99),O36&\"-\"&\"6\",0)","v":0},null,null,{"$error":"#N/A"},{"$error":"#N/A"},{"$f":"IF(AND(T36=13,$R$4>=16,$R$4<=18.99),T36&\"-\"&\"6\",0)","v":{"$error":"#N/A"}},null,null,null,37,"9/10","BU",null,null,"A744",{"$f":"VLOOKUP(BTM_WGT,CALDWELL_A571,4)","v":{"$error":"#N/A"}},null,null,null,10.766500000000001,11.766,9,23.125,25.123999999999999,22.283000000000001]
[null,"Bottom Bead",{"$f":"(((BSW_7SH2-1.875)*2)+((BSH_7SH2-1.875)*2))/12","v":-1.0677083333333333},1.9E-2,-2.028645833333333E-2,null,"8SH2","Length","Weight/ft","Weight",null,null,null,0,0,{"$f":"IF(AND(O37=13,$M$4>=19,$M$4<=21.99),O37&\"-\"&\"9\",0)","v":0},null,null,{"$error":"#N/A"},{"$error":"#N/A"},{"$f":"IF(AND(T37=13,$R$4>=19,$R$4<=21.99),T37&\"-\"&\"9\",0)","v":{"$error":"#N/A"}},null,null,null,38,"9/10","BU",null,null,"A746",{"$f":"VLOOKUP(BTM_WGT,CALDWELL_A571,4)","v":{"$error":"#N/A"}},null,null,null,11.766500000000001,13.766,10,25.125,29.123999999999999,26.283000000000001]
[null,null,null,"Bottom Sash",{"$f":"TRUNC(SUM(E29:E37)+GRID)","v":{"$error":"#VALUE!"}},null,"Bottom Top Rail",{"$f":"BSW_8SH2/12","v":-0.19010416666666666},0.24299999999999999,{"$f":"H38*I38","v":-4.6195312499999995E-2},null,null,null,0,0,{"$f":"IF(AND(O38=13,$M$4>=22,$M$4<=23.99),O38&\"-\"&\"11\",0)","v":0},null,null,{"$error":"#N/A"},{"$error":"#N/A"},{"$f":"IF(AND(T38=13,$R$4>=22,$R$4<=23.99),T38&\"-\"&\"11\",0)","v":{"$error":"#N/A"}},null,null,null,39,"10/10","YW",null,null,"A840",{"$f":"VLOOKUP(BTM_WGT,CALDWELL_A581,4)","v":{"$error":"#N/A"}},null,null,null,13.766500000000002,15.766000000000002,12,29.125000000000004,33.124000000000002,30.283000000000001]
[null,null,null,null,null,null,"Bottom Bottom Rail",{"$f":"BSW_8SH2/12","v":-0.19010416666666666},0.216,-4.1062499999999995E-2,null,null,null,{"$f":"IF(AND(O39>0,P39>0),O39,0)","v":0},0,{"$f":"IF(AND(O39=13,$M$4>=24,$M$4<=26.99),O39&\"-\"&\"12\",0)","v":0},null,null,{"$error":"#N/A"},{"$error":"#N/A"},{"$f":"IF(AND(T39=13,$R$4>=24,$R$4<=26.99),T39&\"-\"&\"12\",0)","v":{"$error":"#N/A"}},null,null,null,40,"10/10","YW",null,null,"A844",{"$f":"VLOOKUP(BTM_WGT,CALDWELL_A581,4)","v":{"$error":"#N/A"}},null,null,null,15.766500000000001,17.766000000000002,14,33.125,37.124000000000002,34.283000000000001]
[null,null,null,null,null,null,"Bottom Stile",{"$f":"(BSH_8SH2*2)/12","v":-0.25},0.186,-4.65E-2,null,null,null,{"$f":"IF(AND(O40>0,P40>0),O40,0)","v":0},0,{"$f":"IF(AND(O40=13,$M$4>=27,$M$4<=29.99),O40&\"-\"&\"13\",0)","v":0},null,null,{"$error":"#N/A"},{"$error":"#N/A"},{"$f":"IF(AND(T40=13,$R$4>=27,$R$4<=29.99),T40&\"-\"&\"13\",0)","v":{"$error":"#N/A"}},null,null,null,41,"10/11","GN",null,null,"A846",{"$f":"VLOOKUP(BTM_WGT,CALDWELL_A581,4)","v":{"$error":"#N/A"}},null,null,null,17.766500000000001,19.766000000000002,16,37.125,41.124000000000002,38.282999999999994]
[null,null,null,null,null,null,"Bottom Rail Reinf.",{"$f":"(BSW_8SH2-2.6875)/12","v":-0.4140625},0.17199999999999999,-7.1218749999999997E-2,null,null,null,{"$f":"IF(AND(O41>0,P41>0),O41,0)","v":0},0,{"$f":"IF(AND(O41=13,$M$4>=30,$M$4<=32.99),O41&\"-\"&\"14\",0)","v":0},null,null,{"$error":"#N/A"},{"$error":"#N/A"},{"$f":"IF(AND(T41=13,$R$4>=30,$R$4<=32.99),T41&\"-\"&\"14\",0)","v":{"$error":"#N/A"}},null,null,null,42,"10/11","GN",null,null,"BOTTUBELENGTH",{"$f":"VLOOKUP(ModelNo,AD29:AE40,2,FALSE)","v":{"$error":"#N/A"}},null,null,null,19.766500000000001,21.766000000000002,18,41.125,45.124000000000002,42.282999999999994]
[null,"7SH3","Length","Weight/ft","Weight",null,"Bottom Stile Reinf.",null,null,0,null,null,null,{"$f":"IF(AND(O42>0,P42>0),O42,0)","v":0},0,{"$f":"IF(AND(O42=13,$M$4>=33,$M$4<=35),O42&\"-\"&\"15\",0)","v":0},null,null,{"$error":"#N/A"},{"$error":"#N/A"},{"$f":"IF(AND(T42=13,$R$4>=33,$R$4<=35),T42&\"-\"&\"15\",0)","v":{"$error":"#N/A"}},null,null,null,43,"11/11","LG",null,null,null,null,null,null,null,21.766500000000001,23.766000000000002,20,45.125,49.124000000000002,46.282999999999994]
[null,"Bottom Top Rail",{"$f":"BSW_7SH3/12","v":-0.14322916666666666},0.24299999999999999,{"$f":"C43*D43","v":-3.4804687499999994E-2},null,"Bottom Glass",{"$f":"(BGW_8SH2*BGH_8SH2)/144","v":0.1345486111111111},{"$f":"GLASS_WGT","v":""},{"$error":"#VALUE!"},null,null,null,0,{"$f":"IF(AND($N$4<=15,$N$4>13),15,0)","v":0},{"$f":"IF(AND(O43=15,$M$4>=4,$M$4<=5.99),O43&\"-\"&\"1\",0)","v":0},null,null,{"$error":"#N/A"},{"$f":"IF(AND($S$4<=15,$S$4>13),15,0)","v":{"$error":"#N/A"}},{"$f":"IF(AND(T43=15,$R$4>=4,$R$4<=5.99),T43&\"-\"&\"1\",0)","v":{"$error":"#N/A"}},null,null,null,44,"11/11","LG",null,null,null,null,null,null,null,23.766500000000001,25.766000000000002,22,49.125,53.124000000000002,50.282999999999994]
[null,"Bottom Bottom Rail",{"$f":"BSW_7SH3/12","v":-0.14322916666666666},0.216,-3.0937499999999996E-2,null,"Bottom Spacer",{"$f":"((BGW_8SH2*2)+(BGH_8SH2*2))/12","v":-1.4739583333333333},5.3600000000000002E-2,-7.9004166666666667E-2,null,null,null,0,0,{"$f":"IF(AND(O44=15,$M$4>=6,$M$4<=8.99),O44&\"-\"&\"2\",0)","v":0},null,null,{"$error":"#N/A"},{"$error":"#N/A"},{"$f":"IF(AND(T44=15,$R$4>=6,$R$4<=8.99),T44&\"-\"&\"2\",0)","v":{"$error":"#N/A"}},null,null,null,45,"7/8/8","OR",null,null,null,null,null,null,null,25.766500000000001,27.766000000000002,24,53.125,57.124000000000002,54.282999999999994]
[null,"Bottom Stile",{"$f":"(BSH_7SH3*2)/12","v":-0.14583333333333334},0.186,-2.7125E-2,null,"Bottom Hardware",1,0.36,0.36,null,null,null,0,0,{"$f":"IF(AND(O45=15,$M$4>=9,$M$4<=11.99),O45&\"-\"&\"3\",0)","v":0},null,null,{"$error":"#N/A"},{"$error":"#N/A"},{"$f":"IF(AND(T45=15,$R$4>=9,$R$4<=11.99),T45&\"-\"&\"3\",0)","v":{"$error":"#N/A"}},null,null,null,46,"7/8/8","OR",null,"CALDWELL BALANCE CHART A581",null,null,null,null,null,27.766500000000001,29.766000000000002,26,57.125,61.124000000000002,58.282999999999994]
[null,"Bott Rail Reinf.",{"$f":"(BSW_7SH3-3)/12","v":-0.39322916666666669},0.17199999999999999,-6.763541666666667E-2,null,"Bottom Bead",{"$f":"((BGW_8SH2*2)+(BGH_8SH2*2))/12","v":-1.4739583333333333},1.9E-2,-2.800520833333333E-2,null,null,null,0,0,{"$f":"IF(AND(O46=15,$M$4>=12,$M$4<=15.99),O46&\"-\"&\"4\",0)","v":0},null,null,{"$error":"#N/A"},{"$error":"#N/A"},{"$f":"IF(AND(T46=15,$R$4>=12,$R$4<=15.99),T46&\"-\"&\"4\",0)","v":{"$error":"#N/A"}},null,null,null,47,"8/8/8","WT",null,"SASH HEIGHT",null,null,"Balance",null,null,29.766499999999997,31.765999999999998,28,61.124999999999993,65.123999999999995,62.282999999999994]
[null,"Bottom Stile Reinf.",null,null,0,null,null,null,"Bottom Sash",{"$f":"TRUNC(SUM(J38:J46)+GRID)","v":{"$error":"#VALUE!"}},null,null,null,0,0,{"$f":"IF(AND(O47=15,$M$4>=16,$M$4<=18.99),O47&\"-\"&\"5\",0)","v":0},null,null,{"$error":"#N/A"},{"$error":"#N/A"},{"$f":"IF(AND(T47=15,$R$4>=16,$R$4<=18.99),T47&\"-\"&\"5\",0)","v":{"$error":"#N/A"}},null,null,null,48,"8/8/8","WT",null,"RANGE",null,null,"Length",null,null,31.766500000000001,33.765999999999998,30,65.125,69.123999999999995,66.282999999999987]
[null,"Bottom Glass",{"$f":"(BGW_7SH3*BGH_7SH3)/144","v":8.3075629340277776E-2},{"$f":"GLASS_WGT","v":""},{"$error":"#VALUE!"},null,null,null,null,null,null,null,null,0,0,{"$f":"IF(AND(O48=15,$M$4>=19,$M$4<=22.99),O48&\"-\"&\"6\",0)","v":0},null,null,{"$error":"#N/A"},{"$error":"#N/A"},{"$f":"IF(AND(T48=15,$R$4>=19,$R$4<=22.99),T48&\"-\"&\"6\",0)","v":{"$error":"#N/A"}},null,null,null,49,"8/8/9","BN",null,9.75,"to",11.749000000000001,7,null,null,33.766500000000001,35.765999999999998,32,69.125,73.123999999999995,70.283000000000001]
[null,"Bottom Spacer",{"$f":"((BGW_7SH3*2)+(BGH_7SH3*2))/12","v":-1.1614583333333333},5.3600000000000002E-2,-6.2254166666666666E-2,null,"8SH3","Length","Weight/ft","Weight",null,null,null,0,0,{"$f":"IF(AND(O49=15,$M$4>=23,$M$4<=25.99),O49&\"-\"&\"9\",0)","v":0},null,null,{"$error":"#N/A"},{"$error":"#N/A"},{"$f":"IF(AND(T49=15,$R$4>=23,$R$4<=25.99),T49&\"-\"&\"9\",0)","v":{"$error":"#N/A"}},null,null,null,50,"8/8/9","BN",null,11.75,"to",13.749000000000001,9,null,null,35.766500000000001,37.765999999999998,34,73.125,77.123999999999995,74.283000000000001]
[null,"Bottom Hardware",1,0.36,0.36,null,"Bottom Top Rail",{"$f":"BSW_8SH3/12","v":-0.18229166666666666},0.24299999999999999,{"$f":"H50*I50","v":-4.4296874999999999E-2},null,null,null,0,0,{"$f":"IF(AND(O50=15,$M$4>=26,$M$4<=26.99),O50&\"-\"&\"11\",0)","v":0},null,null,{"$error":"#N/A"},{"$error":"#N/A"},{"$f":"IF(AND(T50=15,$R$4>=26,$R$4<=26.99),T50&\"-\"&\"11\",0)","v":{"$error":"#N/A"}},null,null,null,51,"8/9/9","RD",null,13.75,"to",15.749000000000001,11,null,null,37.766500000000001,39.765999999999998,36,77.125,81.123999999999995,78.283000000000001]
[null,"Bottom Bead",{"$f":"(((BSW_7SH3-1.875)*2)+((BSH_7SH3-1.875)*2))/12","v":-1.0572916666666667},1.9E-2,-2.0088541666666668E-2,null,"Bottom Bottom Rail",{"$f":"BSW_8SH3/12","v":-0.18229166666666666},0.216,-3.9375E-2,null,null,null,0,0,{"$f":"IF(AND(O51=15,$M$4>=27,$M$4<=29.99),O51&\"-\"&\"12\",0)","v":0},null,null,{"$error":"#N/A"},{"$error":"#N/A"},{"$f":"IF(AND(T51=15,$R$4>=27,$R$4<=29.99),T51&\"-\"&\"12\",0)","v":{"$error":"#N/A"}},null,null,null,52,"8/9/9","RD",null,15.75,"to",17.749000000000002,13,null,null,39.766500000000001,41.765999999999998,38,81.125,85.123999999999995,82.283000000000001]
[null,null,null,"Bottom Sash",{"$f":"TRUNC(SUM(E43:E51)+GRID)","v":{"$error":"#VALUE!"}},null,"Bottom Stile",{"$f":"(BSH_8SH3*2)/12","v":-0.25},0.186,-4.65E-2,null,null,null,0,0,{"$f":"IF(AND(O52=15,$M$4>=30,$M$4<=32.99),O52&\"-\"&\"13\",0)","v":0},null,null,{"$error":"#N/A"},{"$error":"#N/A"},{"$f":"IF(AND(T52=15,$R$4>=30,$R$4<=32.99),T52&\"-\"&\"13\",0)","v":{"$error":"#N/A"}},null,null,null,53,"9/9/9","NAT",null,17.75,"to",19.749000000000002,15,null,null,41.766500000000001,43.765999999999998,40,85.125,89.123999999999995,86.283000000000001]
[null,null,null,null,null,null,"Bott Rail Reinf.",{"$f":"(BSW_8SH3-3)/12","v":-0.43229166666666669},0.17199999999999999,-7.4354166666666666E-2,null,null,null,0,0,{"$f":"IF(AND(O53=15,$M$4>=33,$M$4<=34.99),O53&\"-\"&\"14\",0)","v":0},null,null,{"$error":"#N/A"},{"$error":"#N/A"},{"$f":"IF(AND(T53=15,$R$4>=33,$R$4<=34.99),T53&\"-\"&\"14\",0)","v":{"$error":"#N/A"}},null,null,null,54,"9/9/9","NAT",null,19.75,"to",21.749000000000002,17,null,null,43.766500000000001,45.765999999999998,42,89.125,93.123999999999995,90.283000000000001]
[null,null,null,null,null,null,"Bottom Stile Reinf.",null,null,0,null,null,null,0,0,{"$f":"IF(AND(O54=15,$M$4>=35,$M$4<=37),O54&\"-\"&\"15\",0)","v":0},null,null,{"$error":"#N/A"},{"$error":"#N/A"},{"$f":"IF(AND(T54=15,$R$4>=35,$R$4<=37),T54&\"-\"&\"15\",0)","v":{"$error":"#N/A"}},null,null,null,55,"9/9/10","BU",null,21.75,"to",23.749000000000002,19,null,null,45.766500000000001,47.765999999999998,44,93.125,97.123999999999995,94.283000000000001]
[null,null,null,null,null,null,"Bottom Glass",{"$f":"(BGW_8SH3*BGH_8SH3)/144","v":0.13020833333333334},{"$f":"GLASS_WGT","v":""},{"$error":"#VALUE!"},null,null,null,0,{"$f":"IF(AND($N$4<=17,$N$4>15),17,0)","v":0},{"$f":"IF(AND(O55=17,$M$4>=4,$M$4<=5.99),O55&\"-\"&\"1\",0)","v":0},null,null,{"$error":"#N/A"},{"$f":"IF(AND($S$4<=17,$S$4>15),17,0)","v":{"$error":"#N/A"}},{"$f":"IF(AND(T55=17,$R$4>=4,$R$4<=5.99),T55&\"-\"&\"1\",0)","v":{"$error":"#N/A"}},null,null,null,56,"9/9/10","BU",null,23.75,"to",25.749000000000002,21,null,null,47.766500000000001,49.765999999999998,46,97.125,101.124,98.283000000000001]
[null,null,null,null,null,null,"Bottom Spacer",{"$f":"((BGW_8SH3*2)+(BGH_8SH3*2))/12","v":-1.4479166666666667},5.3600000000000002E-2,-7.7608333333333335E-2,null,null,null,0,0,{"$f":"IF(AND(O56=17,$M$4>=6,$M$4<=8.99),O56&\"-\"&\"2\",0)","v":0},null,null,{"$error":"#N/A"},{"$error":"#N/A"},{"$f":"IF(AND(T56=17,$R$4>=6,$R$4<=8.99),T56&\"-\"&\"2\",0)","v":{"$error":"#N/A"}},null,null,null,57,"9/10/10","LG",null,25.75,"to",27.749000000000002,23,null,null,null,null,null,null,null,{"$f":"IF(TYPE=2,Frame_Height-(VLOOKUP(BSH,AI35:AN55,6)),2.625)","v":2.625}]
[null,null,null,null,null,null,"Bottom Hardware",1,0.36,0.36,null,null,null,0,0,{"$f":"IF(AND(O57=17,$M$4>=9,$M$4<=11.99),O57&\"-\"&\"3\",0)","v":0},null,null,{"$error":"#N/A"},{"$error":"#N/A"},{"$f":"IF(AND(T57=17,$R$4>=9,$R$4<=11.99),T57&\"-\"&\"3\",0)","v":{"$error":"#N/A"}},null,null,null,58,"9/10/10","LG",null,27.75,"to",29.749000000000002,25]
[null,null,null,null,null,null,"Bottom Bead",{"$f":"((BGW_8SH3*2)+(BGH_8SH3*2))/12","v":-1.4479166666666667},1.9E-2,-2.7510416666666666E-2,null,null,null,0,0,{"$f":"IF(AND(O58=17,$M$4>=12,$M$4<=15.99),O58&\"-\"&\"4\",0)","v":0},null,null,{"$error":"#N/A"},{"$error":"#N/A"},{"$f":"IF(AND(T58=17,$R$4>=12,$R$4<=15.99),T58&\"-\"&\"4\",0)","v":{"$error":"#N/A"}},null,null,null,59,"10/10/10","WT",null,29.75,"to",31.749000000000002,27]
[null,null,null,null,null,null,null,null,"Bottom Sash",{"$f":"TRUNC(SUM(J50:J58)+GRID)","v":{"$error":"#VALUE!"}},null,null,null,0,0,{"$f":"IF(AND(O59=17,$M$4>=16,$M$4<=18.99),O59&\"-\"&\"5\",0)","v":0},null,null,{"$error":"#N/A"},{"$error":"#N/A"},{"$f":"IF(AND(T59=17,$R$4>=16,$R$4<=18.99),T59&\"-\"&\"5\",0)","v":{"$error":"#N/A"}},null,null,null,60,"10/10/10","WT",null,31.75,"to",33.749000000000002,29]
[null,null,null,null,null,null,null,null,null,null,null,null,null,0,0,{"$f":"IF(AND(O60=17,$M$4>=19,$M$4<=22.99),O60&\"-\"&\"6\",0)","v":0},null,null,{"$error":"#N/A"},{"$error":"#N/A"},{"$f":"IF(AND(T60=17,$R$4>=19,$R$4<=22.99),T60&\"-\"&\"6\",0)","v":{"$error":"#N/A"}},null,null,null,61,"10/10/11","OR",null,33.75,"to",35.749000000000002,31]
[null,null,null,null,null,null,null,null,null,null,null,null,null,0,0,{"$f":"IF(AND(O61=17,$M$4>=23,$M$4<=25.99),O61&\"-\"&\"9\",0)","v":0},null,null,{"$error":"#N/A"},{"$error":"#N/A"},{"$f":"IF(AND(T61=17,$R$4>=23,$R$4<=25.99),T61&\"-\"&\"9\",0)","v":{"$error":"#N/A"}},null,null,null,62,"10/10/11","OR",null,35.75,"to",37.749000000000002,33]
[null,null,null,null,null,null,null,null,null,null,null,null,null,0,0,{"$f":"IF(AND(O62=17,$M$4>=26,$M$4<=26.99),O62&\"-\"&\"11\",0)","v":0},null,null,{"$error":"#N/A"},{"$error":"#N/A"},{"$f":"IF(AND(T62=17,$R$4>=26,$R$4<=26.99),T62&\"-\"&\"11\",0)","v":{"$error":"#N/A"}},null,null,null,63,"10/11/11","BN",null,37.75,"to",39.749000000000002,35]
[null,null,null,null,null,null,null,null,null,null,null,null,null,0,0,{"$f":"IF(AND(O63=17,$M$4>=27,$M$4<=29.99),O63&\"-\"&\"12\",0)","v":0},null,null,{"$error":"#N/A"},{"$error":"#N/A"},{"$f":"IF(AND(T63=17,$R$4>=27,$R$4<=29.99),T63&\"-\"&\"12\",0)","v":{"$error":"#N/A"}},null,null,null,64,"10/11/11","BN",null,39.75,"to",41.749000000000002,37]
[null,null,null,null,null,null,null,null,null,null,null,null,null,0,0,{"$f":"IF(AND(O64=17,$M$4>=30,$M$4<=32.99),O64&\"-\"&\"13\",0)","v":0},null,null,{"$error":"#N/A"},{"$error":"#N/A"},{"$f":"IF(AND(T64=17,$R$4>=30,$R$4<=32.99),T64&\"-\"&\"13\",0)","v":{"$error":"#N/A"}},null,null,null,65,"11/11/11","GN",null,41.75,"to",43.749000000000002,39]
[null,null,null,null,null,null,null,null,null,null,null,null,null,0,0,{"$f":"IF(AND(O65=17,$M$4>=33,$M$4<=34.99),O65&\"-\"&\"14\",0)","v":0},null,null,{"$error":"#N/A"},{"$error":"#N/A"},{"$f":"IF(AND(T65=17,$R$4>=33,$R$4<=34.99),T65&\"-\"&\"14\",0)","v":{"$error":"#N/A"}},null,null,null,66,"11/11/11","GN",null,43.75,"to",45.749000000000002,41]
[null,null,null,null,null,null,null,null,null,null,null,null,null,0,0,{"$f":"IF(AND(O66=17,$M$4>=35,$M$4<=38),O66&\"-\"&\"15\",0)","v":0},null,null,{"$error":"#N/A"},{"$error":"#N/A"},{"$f":"IF(AND(T66=17,$R$4>=35,$R$4<=38),T66&\"-\"&\"15\",0)","v":{"$error":"#N/A"}},null,null,null,67,"8/8/9/9","RD",null,45.75,"to",47.749000000000002,43]
[null,null,null,null,null,null,null,null,null,null,null,null,null,0,{"$f":"IF(AND($N$4<=19,$N$4>17),19,0)","v":0},{"$f":"IF(AND(O67=19,$M$4>=4,$M$4<=6.99),O67&\"-\"&\"1\",0)","v":0},null,null,{"$error":"#N/A"},{"$f":"IF(AND($S$4<=19,$S$4>17),19,0)","v":{"$error":"#N/A"}},{"$f":"IF(AND(T67=19,$R$4>=4,$R$4<=6.99),T67&\"-\"&\"1\",0)","v":{"$error":"#N/A"}},null,null,null,68,"8/8/9/9","RD",null,47.75,"to",49.749000000000002,45]
[null,null,null,null,null,null,null,null,null,null,null,null,null,0,0,{"$f":"IF(AND(O68=19,$M$4>=7,$M$4<=9.99),O68&\"-\"&\"2\",0)","v":0},null,null,{"$error":"#N/A"},{"$error":"#N/A"},{"$f":"IF(AND(T68=19,$R$4>=7,$R$4<=9.99),T68&\"-\"&\"2\",0)","v":{"$error":"#N/A"}},null,null,null,69,"8/9/9/9","YW"]
[null,null,null,null,null,null,null,null,null,null,null,null,null,0,0,{"$f":"IF(AND(O69=19,$M$4>=10,$M$4<=13.99),O69&\"-\"&\"3\",0)","v":0},null,null,{"$f":"IF(AND(T69>0,U69>0),T69,0)","v":{"$error":"#N/A"}},{"$error":"#N/A"},{"$f":"IF(AND(T69=19,$R$4>=10,$R$4<=13.99),T69&\"-\"&\"3\",0)","v":{"$error":"#N/A"}},null,null,null,70,"8/9/9/9","YW"]
[null,null,null,null,null,null,null,null,null,null,null,null,null,0,0,{"$f":"IF(AND(O70=19,$M$4>=14,$M$4<=18.99),O70&\"-\"&\"4\",0)","v":0},null,null,{"$error":"#N/A"},{"$error":"#N/A"},{"$f":"IF(AND(T70=19,$R$4>=14,$R$4<=18.99),T70&\"-\"&\"4\",0)","v":{"$error":"#N/A"}},null,null,null,71,"9/9/9/9","PU",null,"CALDWELL BALANCE CHART A571"]
[null,null,null,null,null,null,null,null,null,null,null,null,null,0,0,{"$f":"IF(AND(O71=19,$M$4>=19,$M$4<=23.99),O71&\"-\"&\"5\",0)","v":0},null,null,{"$error":"#N/A"},{"$error":"#N/A"},{"$f":"IF(AND(T71=19,$R$4>=19,$R$4<=23.99),T71&\"-\"&\"5\",0)","v":{"$error":"#N/A"}},null,null,null,72,"9/9/9/9","PU",null,"SASH HEIGHT",null,null,"Balance"]
[null,null,null,null,null,null,null,null,null,null,null,null,null,0,0,{"$f":"IF(AND(O72=19,$M$4>=24,$M$4<=26.99),O72&\"-\"&\"6\",0)","v":0},null,null,{"$error":"#N/A"},{"$error":"#N/A"},{"$f":"IF(AND(T72=19,$R$4>=24,$R$4<=26.99),T72&\"-\"&\"6\",0)","v":{"$error":"#N/A"}},null,null,null,null,null,null,null,"RANGE",null,null,"Length"]
[null,null,null,null,null,null,null,null,null,null,null,null,null,0,0,{"$f":"IF(AND(O73=19,$M$4>=27,$M$4<=29.99),O73&\"-\"&\"9\",0)","v":0},null,null,{"$error":"#N/A"},{"$error":"#N/A"},{"$f":"IF(AND(T73=19,$R$4>=27,$R$4<=29.99),T73&\"-\"&\"9\",0)","v":{"$error":"#N/A"}},null,null,null,null,null,null,null,10.375,"to",12.374000000000001,7]
[null,null,null,null,null,null,null,null,null,null,null,null,null,0,0,{"$f":"IF(AND(O74=19,$M$4>=30,$M$4<=30.99),O74&\"-\"&\"11\",0)","v":0},null,null,{"$error":"#N/A"},{"$error":"#N/A"},{"$f":"IF(AND(T74=19,$R$4>=30,$R$4<=30.99),T74&\"-\"&\"11\",0)","v":{"$error":"#N/A"}},null,null,null,4,3,1,null,12.375,"to",14.374000000000001,9]
[null,null,null,null,null,null,null,null,null,null,null,null,null,0,0,{"$f":"IF(AND(O75=19,$M$4>=31,$M$4<=33.99),O75&\"-\"&\"12\",0)","v":0},null,null,{"$error":"#N/A"},{"$error":"#N/A"},{"$f":"IF(AND(T75=19,$R$4>=31,$R$4<=33.99),T75&\"-\"&\"12\",0)","v":{"$error":"#N/A"}},null,null,null,{"$f":"Y74+1","v":5},3,1,null,14.375,"to",16.374000000000002,11]
[null,null,null,null,null,null,null,null,null,null,null,null,null,0,0,{"$f":"IF(AND(O76=19,$M$4>=34,$M$4<=36.99),O76&\"-\"&\"13\",0)","v":0},null,null,{"$error":"#N/A"},{"$error":"#N/A"},{"$f":"IF(AND(T76=19,$R$4>=34,$R$4<=36.99),T76&\"-\"&\"13\",0)","v":{"$error":"#N/A"}},null,null,null,6,3,1,null,16.375,"to",18.374000000000002,13]
[null,null,null,null,null,null,null,null,null,null,null,null,null,0,0,{"$f":"IF(AND(O77=19,$M$4>=37,$M$4<=39.99),O77&\"-\"&\"14\",0)","v":0},null,null,{"$error":"#N/A"},{"$error":"#N/A"},{"$f":"IF(AND(T77=19,$R$4>=37,$R$4<=39.99),T77&\"-\"&\"14\",0)","v":{"$error":"#N/A"}},null,null,null,7,4,1,null,18.375,"to",20.374000000000002,15]
[null,null,null,null,null,null,null,null,null,null,null,null,null,0,0,{"$f":"IF(AND(O78=19,$M$4>=40,$M$4<=42),O78&\"-\"&\"15\",0)","v":0},null,null,{"$error":"#N/A"},{"$error":"#N/A"},{"$f":"IF(AND(T78=19,$R$4>=40,$R$4<=42),T78&\"-\"&\"15\",0)","v":{"$error":"#N/A"}},null,null,null,8,4,1,null,20.375,"to",22.374000000000002,17]
[null,null,null,null,null,null,null,null,null,null,null,null,null,0,{"$f":"IF(AND($N$4<=21,$N$4>19),21,0)","v":0},{"$f":"IF(AND(O79=21,$M$4>=4,$M$4<=6.99),O79&\"-\"&\"1\",0)","v":0},null,null,{"$error":"#N/A"},{"$f":"IF(AND($S$4<=21,$S$4>19),21,0)","v":{"$error":"#N/A"}},{"$f":"IF(AND(T79=21,$R$4>=4,$R$4<=6.99),T79&\"-\"&\"1\",0)","v":{"$error":"#N/A"}},null,null,null,9,5,1,null,22.375,"to",24.374000000000002,19]
[null,null,null,null,null,null,null,null,null,null,null,null,null,0,0,{"$f":"IF(AND(O80=21,$M$4>=7,$M$4<=9.99),O80&\"-\"&\"2\",0)","v":0},null,null,{"$error":"#N/A"},{"$error":"#N/A"},{"$f":"IF(AND(T80=21,$R$4>=7,$R$4<=9.99),T80&\"-\"&\"2\",0)","v":{"$error":"#N/A"}},null,null,null,10,5,1,null,24.375,"to",26.374000000000002,21]
[null,null,null,null,null,null,null,null,null,null,null,null,null,0,0,{"$f":"IF(AND(O81=21,$M$4>=10,$M$4<=13.99),O81&\"-\"&\"3\",0)","v":0},null,null,{"$error":"#N/A"},{"$error":"#N/A"},{"$f":"IF(AND(T81=21,$R$4>=10,$R$4<=13.99),T81&\"-\"&\"3\",0)","v":{"$error":"#N/A"}},null,null,null,11,6,1,null,26.375,"to",28.374000000000002,23]
[null,null,null,null,null,null,null,null,null,null,null,null,null,0,0,{"$f":"IF(AND(O82=21,$M$4>=14,$M$4<=18.99),O82&\"-\"&\"4\",0)","v":0},null,null,{"$error":"#N/A"},{"$error":"#N/A"},{"$f":"IF(AND(T82=21,$R$4>=14,$R$4<=18.99),T82&\"-\"&\"4\",0)","v":{"$error":"#N/A"}},null,null,null,12,6,1,null,28.375,"to",30.374000000000002,25]
[null,null,null,null,null,null,null,null,null,null,null,null,null,0,0,{"$f":"IF(AND(O83=21,$M$4>=19,$M$4<=23.99),O83&\"-\"&\"5\",0)","v":0},null,null,{"$error":"#N/A"},{"$error":"#N/A"},{"$f":"IF(AND(T83=21,$R$4>=19,$R$4<=23.99),T83&\"-\"&\"5\",0)","v":{"$error":"#N/A"}},null,null,null,13,7,1,null,30.375,"to",32.374000000000002,27]
[null,null,null,null,null,null,null,null,null,null,null,null,null,0,0,{"$f":"IF(AND(O84=21,$M$4>=24,$M$4<=26.99),O84&\"-\"&\"6\",0)","v":0},null,null,{"$error":"#N/A"},{"$error":"#N/A"},{"$f":"IF(AND(T84=21,$R$4>=24,$R$4<=26.99),T84&\"-\"&\"6\",0)","v":{"$error":"#N/A"}},null,null,null,14,7,1,null,32.375,"to",34.374000000000002,29]
[null,null,null,null,null,null,null,null,null,null,null,null,null,0,0,{"$f":"IF(AND(O85=21,$M$4>=27,$M$4<=29.99),O85&\"-\"&\"9\",0)","v":0},null,null,{"$error":"#N/A"},{"$error":"#N/A"},{"$f":"IF(AND(T85=21,$R$4>=27,$R$4<=29.99),T85&\"-\"&\"9\",0)","v":{"$error":"#N/A"}},null,null,null,15,8,1,null,34.375,"to",36.374000000000002,31]
[null,null,null,null,null,null,null,null,null,null,null,null,null,0,0,{"$f":"IF(AND(O86=21,$M$4>=30,$M$4<=30.99),O86&\"-\"&\"11\",0)","v":0},null,null,{"$error":"#N/A"},{"$error":"#N/A"},{"$f":"IF(AND(T86=21,$R$4>=30,$R$4<=30.99),T86&\"-\"&\"11\",0)","v":{"$error":"#N/A"}},null,null,null,16,8,1,null,36.375,"to",38.374000000000002,33]
[null,null,null,null,null,null,null,null,null,null,null,null,null,0,0,{"$f":"IF(AND(O87=21,$M$4>=31,$M$4<=33.99),O87&\"-\"&\"12\",0)","v":0},null,null,{"$error":"#N/A"},{"$error":"#N/A"},{"$f":"IF(AND(T87=21,$R$4>=31,$R$4<=33.99),T87&\"-\"&\"12\",0)","v":{"$error":"#N/A"}},null,null,null,17,9,1,null,38.375,"to",40.374000000000002,35]
[null,null,null,null,null,null,null,null,null,null,null,null,null,0,0,{"$f":"IF(AND(O88=21,$M$4>=34,$M$4<=36.99),O88&\"-\"&\"13\",0)","v":0},null,null,{"$error":"#N/A"},{"$error":"#N/A"},{"$f":"IF(AND(T88=21,$R$4>=34,$R$4<=36.99),T88&\"-\"&\"13\",0)","v":{"$error":"#N/A"}},null,null,null,18,9,1,null,40.375,"to",42.374000000000002,37]
[null,null,null,null,null,null,null,null,null,null,null,null,null,0,0,{"$f":"IF(AND(O89=21,$M$4>=37,$M$4<=39.99),O89&\"-\"&\"14\",0)","v":0},null,null,{"$error":"#N/A"},{"$error":"#N/A"},{"$f":"IF(AND(T89=21,$R$4>=37,$R$4<=39.99),T89&\"-\"&\"14\",0)","v":{"$error":"#N/A"}},null,null,null,19,10,1,null,42.375,"to",44.374000000000002,39]
[null,null,null,null,null,null,null,null,null,null,null,null,null,0,0,{"$f":"IF(AND(O90=21,$M$4>=40,$M$4<=42),O90&\"-\"&\"15\",0)","v":0},null,null,{"$error":"#N/A"},{"$error":"#N/A"},{"$f":"IF(AND(T90=21,$R$4>=40,$R$4<=42),T90&\"-\"&\"15\",0)","v":{"$error":"#N/A"}},null,null,null,20,10,1,null,44.375,"to",46.374000000000002,41]
[null,null,null,null,null,null,null,null,null,null,null,null,null,0,{"$f":"IF(AND($N$4<=23,$N$4>21),23,0)","v":0},{"$f":"IF(AND(O91=23,$M$4>=5,$M$4<=7.99),O91&\"-\"&\"1\",0)","v":0},null,null,{"$error":"#N/A"},{"$f":"IF(AND($S$4<=23,$S$4>21),23,0)","v":{"$error":"#N/A"}},{"$f":"IF(AND(T91=23,$R$4>=5,$R$4<=7.99),T91&\"-\"&\"1\",0)","v":{"$error":"#N/A"}},null,null,null,21,"11",1,null,46.375,"to",48.374000000000002,43]
[null,null,null,null,null,null,null,null,null,null,null,null,null,0,0,{"$f":"IF(AND(O92=23,$M$4>=8,$M$4<=10.99),O92&\"-\"&\"2\",0)","v":0},null,null,{"$error":"#N/A"},{"$error":"#N/A"},{"$f":"IF(AND(T92=23,$R$4>=8,$R$4<=10.99),T92&\"-\"&\"2\",0)","v":{"$error":"#N/A"}},null,null,null,22,"11",1,null,48.375,"to",50.374000000000002,45]
[null,null,null,null,null,null,null,null,null,null,null,null,null,0,0,{"$f":"IF(AND(O93=23,$M$4>=11,$M$4<=14.99),O93&\"-\"&\"3\",0)","v":0},null,null,{"$error":"#N/A"},{"$error":"#N/A"},{"$f":"IF(AND(T93=23,$R$4>=11,$R$4<=14.99),T93&\"-\"&\"3\",0)","v":{"$error":"#N/A"}},null,null,null,23,"6/6",2]
[null,null,null,null,null,null,null,null,null,null,null,null,null,0,0,{"$f":"IF(AND(O94=23,$M$4>=15,$M$4<=18.99),O94&\"-\"&\"4\",0)","v":0},null,null,{"$error":"#N/A"},{"$error":"#N/A"},{"$f":"IF(AND(T94=23,$R$4>=15,$R$4<=18.99),T94&\"-\"&\"4\",0)","v":{"$error":"#N/A"}},null,null,null,24,"6/6",2]
[null,null,null,null,null,null,null,null,null,null,null,null,null,0,0,{"$f":"IF(AND(O95=23,$M$4>=19,$M$4<=23.99),O95&\"-\"&\"5\",0)","v":0},null,null,{"$error":"#N/A"},{"$error":"#N/A"},{"$f":"IF(AND(T95=23,$R$4>=19,$R$4<=23.99),T95&\"-\"&\"5\",0)","v":{"$error":"#N/A"}},null,null,null,25,"6/7",2]
[null,null,null,null,null,null,null,null,null,null,null,null,null,0,0,{"$f":"IF(AND(O96=23,$M$4>=24,$M$4<=28.99),O96&\"-\"&\"6\",0)","v":0},null,null,{"$error":"#N/A"},{"$error":"#N/A"},{"$f":"IF(AND(T96=23,$R$4>=24,$R$4<=28.99),T96&\"-\"&\"6\",0)","v":{"$error":"#N/A"}},null,null,null,26,"6/7",2]
[null,null,null,null,null,null,null,null,null,null,null,null,null,0,0,{"$f":"IF(AND(O97=23,$M$4>=29,$M$4<=31.99),O97&\"-\"&\"9\",0)","v":0},null,null,{"$error":"#N/A"},{"$error":"#N/A"},{"$f":"IF(AND(T97=23,$R$4>=29,$R$4<=31.99),T97&\"-\"&\"9\",0)","v":{"$error":"#N/A"}},null,null,null,27,"7/7",2]
[null,null,null,null,null,null,null,null,null,null,null,null,null,0,0,{"$f":"IF(AND(O98=23,$M$4>=32,$M$4<=33.99),O98&\"-\"&\"12\",0)","v":0},null,null,{"$error":"#N/A"},{"$error":"#N/A"},{"$f":"IF(AND(T98=23,$R$4>=32,$R$4<=33.99),T98&\"-\"&\"12\",0)","v":{"$error":"#N/A"}},null,null,null,28,"7/7",2]
[null,null,null,null,null,null,null,null,null,null,null,null,null,0,0,{"$f":"IF(AND(O99=23,$M$4>=34,$M$4<=36.99),O99&\"-\"&\"13\",0)","v":0},null,null,{"$error":"#N/A"},{"$error":"#N/A"},{"$f":"IF(AND(T99=23,$R$4>=34,$R$4<=36.99),T99&\"-\"&\"13\",0)","v":{"$error":"#N/A"}},null,null,null,29,"7/8",2]
[null,null,null,null,null,null,null,null,null,null,null,null,null,0,0,{"$f":"IF(AND(O100=23,$M$4>=37,$M$4<=39.99),O100&\"-\"&\"14\",0)","v":0},null,null,{"$error":"#N/A"},{"$error":"#N/A"},{"$f":"IF(AND(T100=23,$R$4>=37,$R$4<=39.99),T100&\"-\"&\"14\",0)","v":{"$error":"#N/A"}},null,null,null,30,"7/8",2]
[null,null,null,null,null,null,null,null,null,null,null,null,null,0,0,{"$f":"IF(AND(O101=23,$M$4>=40,$M$4<=43),O101&\"-\"&\"15\",0)","v":0},null,null,{"$error":"#N/A"},{"$error":"#N/A"},{"$f":"IF(AND(T101=23,$R$4>=40,$R$4<=43),T101&\"-\"&\"15\",0)","v":{"$error":"#N/A"}},null,null,null,31,"8/8",2]
[null,null,null,null,null,null,null,null,null,null,null,null,null,0,{"$f":"IF(AND($N$4<=25,$N$4>23),25,0)","v":0},{"$f":"IF(AND(O102=25,$M$4>=5,$M$4<=7.99),O102&\"-\"&\"1\",0)","v":0},null,null,{"$error":"#N/A"},{"$f":"IF(AND($S$4<=25,$S$4>23),25,0)","v":{"$error":"#N/A"}},{"$f":"IF(AND(T102=25,$R$4>=5,$R$4<=7.99),T102&\"-\"&\"1\",0)","v":{"$error":"#N/A"}},null,null,null,32,"8/8",2]
[null,null,null,null,null,null,null,null,null,null,null,null,null,0,0,{"$f":"IF(AND(O103=25,$M$4>=8,$M$4<=10.99),O103&\"-\"&\"2\",0)","v":0},null,null,{"$error":"#N/A"},{"$error":"#N/A"},{"$f":"IF(AND(T103=25,$R$4>=8,$R$4<=10.99),T103&\"-\"&\"2\",0)","v":{"$error":"#N/A"}},null,null,null,33,"8/9",2]
[null,null,null,null,null,null,null,null,null,null,null,null,null,0,0,{"$f":"IF(AND(O104=25,$M$4>=11,$M$4<=14.99),O104&\"-\"&\"3\",0)","v":0},null,null,{"$error":"#N/A"},{"$error":"#N/A"},{"$f":"IF(AND(T104=25,$R$4>=11,$R$4<=14.99),T104&\"-\"&\"3\",0)","v":{"$error":"#N/A"}},null,null,null,34,"8/9",2]
[null,null,null,null,null,null,null,null,null,null,null,null,null,0,0,{"$f":"IF(AND(O105=25,$M$4>=15,$M$4<=18.99),O105&\"-\"&\"4\",0)","v":0},null,null,{"$error":"#N/A"},{"$error":"#N/A"},{"$f":"IF(AND(T105=25,$R$4>=15,$R$4<=18.99),T105&\"-\"&\"4\",0)","v":{"$error":"#N/A"}},null,null,null,35,"9/9",2]
[null,null,null,null,null,null,null,null,null,null,null,null,null,{"$f":"IF(AND(O106>0,P106>0),O106,0)","v":0},0,{"$f":"IF(AND(O106=25,$M$4>=19,$M$4<=23.99),O106&\"-\"&\"5\",0)","v":0},null,null,{"$error":"#N/A"},{"$error":"#N/A"},{"$f":"IF(AND(T106=25,$R$4>=19,$R$4<=23.99),T106&\"-\"&\"5\",0)","v":{"$error":"#N/A"}},null,null,null,36,"9/9",2]
[null,null,null,null,null,null,null,null,null,null,null,null,null,0,0,{"$f":"IF(AND(O107=25,$M$4>=24,$M$4<=28.99),O107&\"-\"&\"6\",0)","v":0},null,null,{"$error":"#N/A"},{"$error":"#N/A"},{"$f":"IF(AND(T107=25,$R$4>=24,$R$4<=28.99),T107&\"-\"&\"6\",0)","v":{"$error":"#N/A"}},null,null,null,37,"9/10",2]
[null,null,null,null,null,null,null,null,null,null,null,null,null,0,0,{"$f":"IF(AND(O108=25,$M$4>=29,$M$4<=33.99),O108&\"-\"&\"9\",0)","v":0},null,null,{"$error":"#N/A"},{"$error":"#N/A"},{"$f":"IF(AND(T108=25,$R$4>=29,$R$4<=33.99),T108&\"-\"&\"9\",0)","v":{"$error":"#N/A"}},null,null,null,38,"9/10",2]
[null,null,null,null,null,null,null,null,null,null,null,null,null,0,0,{"$f":"IF(AND(O109=25,$M$4>=34,$M$4<=35.99),O109&\"-\"&\"11\",0)","v":0},null,null,{"$error":"#N/A"},{"$error":"#N/A"},{"$f":"IF(AND(T109=25,$R$4>=34,$R$4<=35.99),T109&\"-\"&\"11\",0)","v":{"$error":"#N/A"}},null,null,null,39,"10/10",2]
[null,null,null,null,null,null,null,null,null,null,null,null,null,0,0,{"$f":"IF(AND(O110=25,$M$4>=36,$M$4<=38.99),O110&\"-\"&\"12\",0)","v":0},null,null,{"$error":"#N/A"},{"$error":"#N/A"},{"$f":"IF(AND(T110=25,$R$4>=36,$R$4<=38.99),T110&\"-\"&\"12\",0)","v":{"$error":"#N/A"}},null,null,null,40,"10/10",2]
[null,null,null,null,null,null,null,null,null,null,null,null,null,0,0,{"$f":"IF(AND(O111=25,$M$4>=39,$M$4<=41.99),O111&\"-\"&\"13\",0)","v":0},null,null,{"$error":"#N/A"},{"$error":"#N/A"},{"$f":"IF(AND(T111=25,$R$4>=39,$R$4<=41.99),T111&\"-\"&\"13\",0)","v":{"$error":"#N/A"}},null,null,null,41,"10/11",2]
[null,null,null,null,null,null,null,null,null,null,null,null,null,0,0,{"$f":"IF(AND(O112=25,$M$4>=42,$M$4<=44.99),O112&\"-\"&\"14\",0)","v":0},null,null,{"$error":"#N/A"},{"$error":"#N/A"},{"$f":"IF(AND(T112=25,$R$4>=42,$R$4<=44.99),T112&\"-\"&\"14\",0)","v":{"$error":"#N/A"}},null,null,null,42,"10/11",2]
[null,null,null,null,null,null,null,null,null,null,null,null,null,0,0,{"$f":"IF(AND(O113=25,$M$4>=45,$M$4<=46.99),O113&\"-\"&\"15\",0)","v":0},null,null,{"$error":"#N/A"},{"$error":"#N/A"},{"$f":"IF(AND(T113=25,$R$4>=45,$R$4<=46.99),T113&\"-\"&\"15\",0)","v":{"$error":"#N/A"}},null,null,null,43,"11/11",2]
[null,null,null,null,null,null,null,null,null,null,null,null,null,0,0,{"$f":"IF(AND(O114=25,$M$4>=47,$M$4<=49),O114&\"-\"&\"16\",0)","v":0},null,null,{"$error":"#N/A"},{"$error":"#N/A"},{"$f":"IF(AND(T114=25,$R$4>=47,$R$4<=49),T114&\"-\"&\"16\",0)","v":{"$error":"#N/A"}},null,null,null,44,"11/11",2]
[null,null,null,null,null,null,null,null,null,null,null,null,null,0,{"$f":"IF(AND($N$4<=27,$N$4>25),27,0)","v":0},{"$f":"IF(AND(O115=27,$M$4>=5,$M$4<=7.99),O115&\"-\"&\"1\",0)","v":0},null,null,{"$error":"#N/A"},{"$f":"IF(AND($S$4<=27,$S$4>25),27,0)","v":{"$error":"#N/A"}},{"$f":"IF(AND(T115=27,$R$4>=5,$R$4<=7.99),T115&\"-\"&\"1\",0)","v":{"$error":"#N/A"}},null,null,null,45,"8/7/8",3]
[null,null,null,null,null,null,null,null,null,null,null,null,null,0,0,{"$f":"IF(AND(O116=27,$M$4>=8,$M$4<=11.99),O116&\"-\"&\"2\",0)","v":0},null,null,{"$error":"#N/A"},{"$error":"#N/A"},{"$f":"IF(AND(T116=27,$R$4>=8,$R$4<=11.99),T116&\"-\"&\"2\",0)","v":{"$error":"#N/A"}},null,null,null,46,"8/7/8",3]
[null,null,null,null,null,null,null,null,null,null,null,null,null,0,0,{"$f":"IF(AND(O117=27,$M$4>=12,$M$4<=16.99),O117&\"-\"&\"3\",0)","v":0},null,null,{"$error":"#N/A"},{"$error":"#N/A"},{"$f":"IF(AND(T117=27,$R$4>=12,$R$4<=16.99),T117&\"-\"&\"3\",0)","v":{"$error":"#N/A"}},null,null,null,47,"8/8/8",3]
[null,null,null,null,null,null,null,null,null,null,null,null,null,0,0,{"$f":"IF(AND(O118=27,$M$4>=17,$M$4<=21.99),O118&\"-\"&\"4\",0)","v":0},null,null,{"$error":"#N/A"},{"$error":"#N/A"},{"$f":"IF(AND(T118=27,$R$4>=17,$R$4<=21.99),T118&\"-\"&\"4\",0)","v":{"$error":"#N/A"}},null,null,null,48,"8/8/8",3]
[null,null,null,null,null,null,null,null,null,null,null,null,null,0,0,{"$f":"IF(AND(O119=27,$M$4>=22,$M$4<=26.99),O119&\"-\"&\"5\",0)","v":0},null,null,{"$error":"#N/A"},{"$error":"#N/A"},{"$f":"IF(AND(T119=27,$R$4>=22,$R$4<=26.99),T119&\"-\"&\"5\",0)","v":{"$error":"#N/A"}},null,null,null,49,"8/8/9",3]
[null,null,null,null,null,null,null,null,null,null,null,null,null,0,0,{"$f":"IF(AND(O120=27,$M$4>=27,$M$4<=30.99),O120&\"-\"&\"6\",0)","v":0},null,null,{"$error":"#N/A"},{"$error":"#N/A"},{"$f":"IF(AND(T120=27,$R$4>=27,$R$4<=30.99),T120&\"-\"&\"6\",0)","v":{"$error":"#N/A"}},null,null,null,50,"8/8/9",3]
[null,null,null,null,null,null,null,null,null,null,null,null,null,0,0,{"$f":"IF(AND(O121=27,$M$4>=31,$M$4<=35.99),O121&\"-\"&\"9\",0)","v":0},null,null,{"$error":"#N/A"},{"$error":"#N/A"},{"$f":"IF(AND(T121=27,$R$4>=31,$R$4<=35.99),T121&\"-\"&\"9\",0)","v":{"$error":"#N/A"}},null,null,null,51,"8/9/9",3]
[null,null,null,null,null,null,null,null,null,null,null,null,null,0,0,{"$f":"IF(AND(O122=27,$M$4>=36,$M$4<=36.99),O122&\"-\"&\"11\",0)","v":0},null,null,{"$error":"#N/A"},{"$error":"#N/A"},{"$f":"IF(AND(T122=27,$R$4>=36,$R$4<=36.99),T122&\"-\"&\"11\",0)","v":{"$error":"#N/A"}},null,null,null,52,"8/9/9",3]
[null,null,null,null,null,null,null,null,null,null,null,null,null,0,0,{"$f":"IF(AND(O123=27,$M$4>=37,$M$4<=39.99),O123&\"-\"&\"12\",0)","v":0},null,null,{"$error":"#N/A"},{"$error":"#N/A"},{"$f":"IF(AND(T123=27,$R$4>=37,$R$4<=39.99),T123&\"-\"&\"12\",0)","v":{"$error":"#N/A"}},null,null,null,53,"9/9/9",3]
[null,null,null,null,null,null,null,null,null,null,null,null,null,0,0,{"$f":"IF(AND(O124=27,$M$4>=40,$M$4<=42.99),O124&\"-\"&\"13\",0)","v":0},null,null,{"$error":"#N/A"},{"$error":"#N/A"},{"$f":"IF(AND(T124=27,$R$4>=40,$R$4<=42.99),T124&\"-\"&\"13\",0)","v":{"$error":"#N/A"}},null,null,null,54,"9/9/9",3]
[null,null,null,null,null,null,null,null,null,null,null,null,null,0,0,{"$f":"IF(AND(O125=27,$M$4>=43,$M$4<=44.99),O125&\"-\"&\"14\",0)","v":0},null,null,{"$error":"#N/A"},{"$error":"#N/A"},{"$f":"IF(AND(T125=27,$R$4>=43,$R$4<=44.99),T125&\"-\"&\"14\",0)","v":{"$error":"#N/A"}},null,null,null,55,"9/9/10",3]
[null,null,null,null,null,null,null,null,null,null,null,null,null,0,0,{"$f":"IF(AND(O126=27,$M$4>=45,$M$4<=46.99),O126&\"-\"&\"15\",0)","v":0},null,null,{"$error":"#N/A"},{"$error":"#N/A"},{"$f":"IF(AND(T126=27,$R$4>=45,$R$4<=46.99),T126&\"-\"&\"15\",0)","v":{"$error":"#N/A"}},null,null,null,56,"9/9/10",3]
[null,null,null,null,null,null,null,null,null,null,null,null,null,0,0,{"$f":"IF(AND(O127=27,$M$4>=47,$M$4<=50),O127&\"-\"&\"16\",0)","v":0},null,null,{"$error":"#N/A"},{"$error":"#N/A"},{"$f":"IF(AND(T127=27,$R$4>=47,$R$4<=50),T127&\"-\"&\"16\",0)","v":{"$error":"#N/A"}},null,null,null,57,"9/10/10",3]
[null,null,null,null,null,null,null,null,null,null,null,null,null,0,{"$f":"IF(AND($N$4<=29,$N$4>27),29,0)","v":0},{"$f":"IF(AND(O128=29,$M$4>=6,$M$4<=8.99),O128&\"-\"&\"1\",0)","v":0},null,null,{"$error":"#N/A"},{"$f":"IF(AND($S$4<=29,$S$4>27),29,0)","v":{"$error":"#N/A"}},{"$f":"IF(AND(T128=29,$R$4>=6,$R$4<=8.99),T128&\"-\"&\"1\",0)","v":{"$error":"#N/A"}},null,null,null,58,"9/10/10",3]
[null,null,null,null,null,null,null,null,null,null,null,null,null,0,0,{"$f":"IF(AND(O129=29,$M$4>=9,$M$4<=12.99),O129&\"-\"&\"2\",0)","v":0},null,null,{"$error":"#N/A"},{"$error":"#N/A"},{"$f":"IF(AND(T129=29,$R$4>=9,$R$4<=12.99),T129&\"-\"&\"2\",0)","v":{"$error":"#N/A"}},null,null,null,59,"10/10/10",3]
[null,null,null,null,null,null,null,null,null,null,null,null,null,0,0,{"$f":"IF(AND(O130=29,$M$4>=13,$M$4<=17.99),O130&\"-\"&\"3\",0)","v":0},null,null,{"$error":"#N/A"},{"$error":"#N/A"},{"$f":"IF(AND(T130=29,$R$4>=13,$R$4<=17.99),T130&\"-\"&\"3\",0)","v":{"$error":"#N/A"}},null,null,null,60,"10/10/10",3]
[null,null,null,null,null,null,null,null,null,null,null,null,null,0,0,{"$f":"IF(AND(O131=29,$M$4>=18,$M$4<=23.99),O131&\"-\"&\"4\",0)","v":0},null,null,{"$error":"#N/A"},{"$error":"#N/A"},{"$f":"IF(AND(T131=29,$R$4>=18,$R$4<=23.99),T131&\"-\"&\"4\",0)","v":{"$error":"#N/A"}},null,null,null,61,"10/10/11",3]
[null,null,null,null,null,null,null,null,null,null,null,null,null,0,0,{"$f":"IF(AND(O132=29,$M$4>=24,$M$4<=29.99),O132&\"-\"&\"5\",0)","v":0},null,null,{"$error":"#N/A"},{"$error":"#N/A"},{"$f":"IF(AND(T132=29,$R$4>=24,$R$4<=29.99),T132&\"-\"&\"5\",0)","v":{"$error":"#N/A"}},null,null,null,62,"10/10/11",3]
[null,null,null,null,null,null,null,null,null,null,null,null,null,0,0,{"$f":"IF(AND(O133=29,$M$4>=30,$M$4<=34.99),O133&\"-\"&\"6\",0)","v":0},null,null,{"$f":"IF(AND(T133>0,U133>0),T133,0)","v":{"$error":"#N/A"}},{"$error":"#N/A"},{"$f":"IF(AND(T133=29,$R$4>=30,$R$4<=34.99),T133&\"-\"&\"6\",0)","v":{"$error":"#N/A"}},null,null,null,63,"10/11/11",3]
[null,null,null,null,null,null,null,null,null,null,null,null,null,0,0,{"$f":"IF(AND(O134=29,$M$4>=35,$M$4<=37.99),O134&\"-\"&\"9\",0)","v":0},null,null,{"$error":"#N/A"},{"$error":"#N/A"},{"$f":"IF(AND(T134=29,$R$4>=35,$R$4<=37.99),T134&\"-\"&\"9\",0)","v":{"$error":"#N/A"}},null,null,null,64,"10/11/11",3]
[null,null,null,null,null,null,null,null,null,null,null,null,null,0,0,{"$f":"IF(AND(O135=29,$M$4>=38,$M$4<=40.99),O135&\"-\"&\"12\",0)","v":0},null,null,{"$error":"#N/A"},{"$error":"#N/A"},{"$f":"IF(AND(T135=29,$R$4>=38,$R$4<=40.99),T135&\"-\"&\"12\",0)","v":{"$error":"#N/A"}},null,null,null,65,"11/11/11",3]
[null,null,null,null,null,null,null,null,null,null,null,null,null,0,0,{"$f":"IF(AND(O136=29,$M$4>=41,$M$4<=42.99),O136&\"-\"&\"13\",0)","v":0},null,null,{"$error":"#N/A"},{"$error":"#N/A"},{"$f":"IF(AND(T136=29,$R$4>=41,$R$4<=42.99),T136&\"-\"&\"13\",0)","v":{"$error":"#N/A"}},null,null,null,66,"11/11/11",3]
[null,null,null,null,null,null,null,null,null,null,null,null,null,0,0,{"$f":"IF(AND(O137=29,$M$4>=43,$M$4<=44.99),O137&\"-\"&\"14\",0)","v":0},null,null,{"$error":"#N/A"},{"$error":"#N/A"},{"$f":"IF(AND(T137=29,$R$4>=43,$R$4<=44.99),T137&\"-\"&\"14\",0)","v":{"$error":"#N/A"}},null,null,null,67,"8/8/9/9",4]
[null,null,null,null,null,null,null,null,null,null,null,null,null,0,0,{"$f":"IF(AND(O138=29,$M$4>=45,$M$4<=46.99),O138&\"-\"&\"15\",0)","v":0},null,null,{"$error":"#N/A"},{"$error":"#N/A"},{"$f":"IF(AND(T138=29,$R$4>=45,$R$4<=46.99),T138&\"-\"&\"15\",0)","v":{"$error":"#N/A"}},null,null,null,68,"8/8/9/9",4]
[null,null,null,null,null,null,null,null,null,null,null,null,null,0,0,{"$f":"IF(AND(O139=29,$M$4>=47,$M$4<=49.99),O139&\"-\"&\"16\",0)","v":0},null,null,{"$error":"#N/A"},{"$error":"#N/A"},{"$f":"IF(AND(T139=29,$R$4>=47,$R$4<=49.99),T139&\"-\"&\"16\",0)","v":{"$error":"#N/A"}},null,null,null,69,"8/9/9/9",4]
[null,null,null,null,null,null,null,null,null,null,null,null,null,0,0,{"$f":"IF(AND(O140=29,$M$4>=50,$M$4<=52),O140&\"-\"&\"17\",0)","v":0},null,null,{"$error":"#N/A"},{"$error":"#N/A"},{"$f":"IF(AND(T140=29,$R$4>=50,$R$4<=52),T140&\"-\"&\"17\",0)","v":{"$error":"#N/A"}},null,null,null,70,"8/9/9/9",4]
[null,null,null,null,null,null,null,null,null,null,null,null,null,0,{"$f":"IF(AND($N$4<=31,$N$4>29),31,0)","v":0},{"$f":"IF(AND(O141=31,$M$4>=6,$M$4<=8.99),O141&\"-\"&\"1\",0)","v":0},null,null,{"$error":"#N/A"},{"$f":"IF(AND($S$4<=31,$S$4>29),31,0)","v":{"$error":"#N/A"}},{"$f":"IF(AND(T141=31,$R$4>=6,$R$4<=8.99),T141&\"-\"&\"1\",0)","v":{"$error":"#N/A"}},null,null,null,71,"9/9/9/9",4]
[null,null,null,null,null,null,null,null,null,null,null,null,null,0,0,{"$f":"IF(AND(O142=31,$M$4>=9,$M$4<=12.99),O142&\"-\"&\"2\",0)","v":0},null,null,{"$error":"#N/A"},{"$error":"#N/A"},{"$f":"IF(AND(T142=31,$R$4>=9,$R$4<=12.99),T142&\"-\"&\"2\",0)","v":{"$error":"#N/A"}},null,null,null,72,"9/9/9/9",4]
[null,null,null,null,null,null,null,null,null,null,null,null,null,0,0,{"$f":"IF(AND(O143=31,$M$4>=13,$M$4<=17.99),O143&\"-\"&\"3\",0)","v":0},null,null,{"$error":"#N/A"},{"$error":"#N/A"},{"$f":"IF(AND(T143=31,$R$4>=13,$R$4<=17.99),T143&\"-\"&\"3\",0)","v":{"$error":"#N/A"}}]
[null,null,null,null,null,null,null,null,null,null,null,null,null,0,0,{"$f":"IF(AND(O144=31,$M$4>=18,$M$4<=23.99),O144&\"-\"&\"4\",0)","v":0},null,null,{"$error":"#N/A"},{"$error":"#N/A"},{"$f":"IF(AND(T144=31,$R$4>=18,$R$4<=23.99),T144&\"-\"&\"4\",0)","v":{"$error":"#N/A"}}]
[null,null,null,null,null,null,null,null,null,null,null,null,null,0,0,{"$f":"IF(AND(O145=31,$M$4>=24,$M$4<=29.99),O145&\"-\"&\"5\",0)","v":0},null,null,{"$error":"#N/A"},{"$error":"#N/A"},{"$f":"IF(AND(T145=31,$R$4>=24,$R$4<=29.99),T145&\"-\"&\"5\",0)","v":{"$error":"#N/A"}}]
[null,null,null,null,null,null,null,null,null,null,null,null,null,0,0,{"$f":"IF(AND(O146=31,$M$4>=30,$M$4<=34.99),O146&\"-\"&\"6\",0)","v":0},null,null,{"$error":"#N/A"},{"$error":"#N/A"},{"$f":"IF(AND(T146=31,$R$4>=30,$R$4<=34.99),T146&\"-\"&\"6\",0)","v":{"$error":"#N/A"}}]
[null,null,null,null,null,null,null,null,null,null,null,null,null,0,0,{"$f":"IF(AND(O147=31,$M$4>=35,$M$4<=37.99),O147&\"-\"&\"9\",0)","v":0},null,null,{"$error":"#N/A"},{"$error":"#N/A"},{"$f":"IF(AND(T147=31,$R$4>=35,$R$4<=37.99),T147&\"-\"&\"9\",0)","v":{"$error":"#N/A"}}]
[null,null,null,null,null,null,null,null,null,null,null,null,null,0,0,{"$f":"IF(AND(O148=31,$M$4>=38,$M$4<=40.99),O148&\"-\"&\"12\",0)","v":0},null,null,{"$error":"#N/A"},{"$error":"#N/A"},{"$f":"IF(AND(T148=31,$R$4>=38,$R$4<=40.99),T148&\"-\"&\"12\",0)","v":{"$error":"#N/A"}}]
[null,null,null,null,null,null,null,null,null,null,null,null,null,0,0,{"$f":"IF(AND(O149=31,$M$4>=41,$M$4<=42.99),O149&\"-\"&\"13\",0)","v":0},null,null,{"$error":"#N/A"},{"$error":"#N/A"},{"$f":"IF(AND(T149=31,$R$4>=41,$R$4<=42.99),T149&\"-\"&\"13\",0)","v":{"$error":"#N/A"}}]
[null,null,null,null,null,null,null,null,null,null,null,null,null,0,0,{"$f":"IF(AND(O150=31,$M$4>=43,$M$4<=44.99),O150&\"-\"&\"14\",0)","v":0},null,null,{"$error":"#N/A"},{"$error":"#N/A"},{"$f":"IF(AND(T150=31,$R$4>=43,$R$4<=44.99),T150&\"-\"&\"14\",0)","v":{"$error":"#N/A"}}]
[null,null,null,null,null,null,null,null,null,null,null,null,null,0,0,{"$f":"IF(AND(O151=31,$M$4>=45,$M$4<=47.99),O151&\"-\"&\"15\",0)","v":0},null,null,{"$error":"#N/A"},{"$error":"#N/A"},{"$f":"IF(AND(T151=31,$R$4>=45,$R$4<=47.99),T151&\"-\"&\"15\",0)","v":{"$error":"#N/A"}}]
[null,null,null,null,null,null,null,null,null,null,null,null,null,0,0,{"$f":"IF(AND(O152=31,$M$4>=48,$M$4<=49.99),O152&\"-\"&\"16\",0)","v":0},null,null,{"$error":"#N/A"},{"$error":"#N/A"},{"$f":"IF(AND(T152=31,$R$4>=48,$R$4<=49.99),T152&\"-\"&\"16\",0)","v":{"$error":"#N/A"}}]
[null,null,null,null,null,null,null,null,null,null,null,null,null,0,0,{"$f":"IF(AND(O153=31,$M$4>=50,$M$4<=52),O153&\"-\"&\"17\",0)","v":0},null,null,{"$error":"#N/A"},{"$error":"#N/A"},{"$f":"IF(AND(T153=31,$R$4>=50,$R$4<=52),T153&\"-\"&\"17\",0)","v":{"$error":"#N/A"}}]
[null,null,null,null,null,null,null,null,null,null,null,null,null,0,{"$f":"IF(AND($N$4<=33,$N$4>31),33,0)","v":0},{"$f":"IF(AND(O154=33,$M$4>=6,$M$4<=8.99),O154&\"-\"&\"1\",0)","v":0},null,null,{"$error":"#N/A"},{"$f":"IF(AND($S$4<=33,$S$4>31),33,0)","v":{"$error":"#N/A"}},{"$f":"IF(AND(T154=33,$R$4>=6,$R$4<=8.99),T154&\"-\"&\"1\",0)","v":{"$error":"#N/A"}}]
[null,null,null,null,null,null,null,null,null,null,null,null,null,0,0,{"$f":"IF(AND(O155=33,$M$4>=9,$M$4<=12.99),O155&\"-\"&\"2\",0)","v":0},null,null,{"$error":"#N/A"},{"$error":"#N/A"},{"$f":"IF(AND(T155=33,$R$4>=9,$R$4<=12.99),T155&\"-\"&\"2\",0)","v":{"$error":"#N/A"}}]
[null,null,null,null,null,null,null,null,null,null,null,null,null,0,0,{"$f":"IF(AND(O156=33,$M$4>=13,$M$4<=17.99),O156&\"-\"&\"3\",0)","v":0},null,null,{"$error":"#N/A"},{"$error":"#N/A"},{"$f":"IF(AND(T156=33,$R$4>=13,$R$4<=17.99),T156&\"-\"&\"3\",0)","v":{"$error":"#N/A"}}]
[null,null,null,null,null,null,null,null,null,null,null,null,null,0,0,{"$f":"IF(AND(O157=33,$M$4>=18,$M$4<=23.99),O157&\"-\"&\"4\",0)","v":0},null,null,{"$error":"#N/A"},{"$error":"#N/A"},{"$f":"IF(AND(T157=33,$R$4>=18,$R$4<=23.99),T157&\"-\"&\"4\",0)","v":{"$error":"#N/A"}}]
[null,null,null,null,null,null,null,null,null,null,null,null,null,0,0,{"$f":"IF(AND(O158=33,$M$4>=24,$M$4<=29.99),O158&\"-\"&\"5\",0)","v":0},null,null,{"$error":"#N/A"},{"$error":"#N/A"},{"$f":"IF(AND(T158=33,$R$4>=24,$R$4<=29.99),T158&\"-\"&\"5\",0)","v":{"$error":"#N/A"}}]
[null,null,null,null,null,null,null,null,null,null,null,null,null,0,0,{"$f":"IF(AND(O159=33,$M$4>=30,$M$4<=34.99),O159&\"-\"&\"6\",0)","v":0},null,null,{"$error":"#N/A"},{"$error":"#N/A"},{"$f":"IF(AND(T159=33,$R$4>=30,$R$4<=34.99),T159&\"-\"&\"6\",0)","v":{"$error":"#N/A"}}]
[null,null,null,null,null,null,null,null,null,null,null,null,null,0,0,{"$f":"IF(AND(O160=33,$M$4>=35,$M$4<=37.99),O160&\"-\"&\"9\",0)","v":0},null,null,{"$error":"#N/A"},{"$error":"#N/A"},{"$f":"IF(AND(T160=33,$R$4>=35,$R$4<=37.99),T160&\"-\"&\"9\",0)","v":{"$error":"#N/A"}}]
[null,null,null,null,null,null,null,null,null,null,null,null,null,0,0,{"$f":"IF(AND(O161=33,$M$4>=38,$M$4<=40.99),O161&\"-\"&\"12\",0)","v":0},null,null,{"$error":"#N/A"},{"$error":"#N/A"},{"$f":"IF(AND(T161=33,$R$4>=38,$R$4<=40.99),T161&\"-\"&\"12\",0)","v":{"$error":"#N/A"}}]
[null,null,null,null,null,null,null,null,null,null,null,null,null,0,0,{"$f":"IF(AND(O162=33,$M$4>=41,$M$4<=42.99),O162&\"-\"&\"13\",0)","v":0},null,null,{"$error":"#N/A"},{"$error":"#N/A"},{"$f":"IF(AND(T162=33,$R$4>=41,$R$4<=42.99),T162&\"-\"&\"13\",0)","v":{"$error":"#N/A"}}]
[null,null,null,null,null,null,null,null,null,null,null,null,null,0,0,{"$f":"IF(AND(O163=33,$M$4>=43,$M$4<=44.99),O163&\"-\"&\"14\",0)","v":0},null,null,{"$error":"#N/A"},{"$error":"#N/A"},{"$f":"IF(AND(T163=33,$R$4>=43,$R$4<=44.99),T163&\"-\"&\"14\",0)","v":{"$error":"#N/A"}}]
[null,null,null,null,null,null,null,null,null,null,null,null,null,0,0,{"$f":"IF(AND(O164=33,$M$4>=45,$M$4<=47.99),O164&\"-\"&\"15\",0)","v":0},null,null,{"$error":"#N/A"},{"$error":"#N/A"},{"$f":"IF(AND(T164=33,$R$4>=45,$R$4<=47.99),T164&\"-\"&\"15\",0)","v":{"$error":"#N/A"}}]
[null,null,null,null,null,null,null,null,null,null,null,null,null,0,0,{"$f":"IF(AND(O165=33,$M$4>=48,$M$4<=49.99),O165&\"-\"&\"16\",0)","v":0},null,null,{"$error":"#N/A"},{"$error":"#N/A"},{"$f":"IF(AND(T165=33,$R$4>=48,$R$4<=49.99),T165&\"-\"&\"16\",0)","v":{"$error":"#N/A"}}]
[null,null,null,null,null,null,null,null,null,null,null,null,null,0,0,{"$f":"IF(AND(O166=33,$M$4>=50,$M$4<=52),O166&\"-\"&\"17\",0)","v":0},null,null,{"$error":"#N/A"},{"$error":"#N/A"},{"$f":"IF(AND(T166=33,$R$4>=50,$R$4<=52),T166&\"-\"&\"17\",0)","v":{"$error":"#N/A"}}]
[null,null,null,null,null,null,null,null,null,null,null,null,null,0,{"$f":"IF(AND($N$4<=35,$N$4>33),35,0)","v":0},{"$f":"IF(AND(O167=35,$M$4>=8,$M$4<=11.99),O167&\"-\"&\"1\",0)","v":0},null,null,{"$error":"#N/A"},{"$f":"IF(AND($S$4<=35,$S$4>33),35,0)","v":{"$error":"#N/A"}},{"$f":"IF(AND(T167=35,$R$4>=8,$R$4<=11.99),T167&\"-\"&\"1\",0)","v":{"$error":"#N/A"}}]
[null,null,null,null,null,null,null,null,null,null,null,null,null,0,0,{"$f":"IF(AND(O168=35,$M$4>=12,$M$4<=16.99),O168&\"-\"&\"2\",0)","v":0},null,null,{"$error":"#N/A"},{"$error":"#N/A"},{"$f":"IF(AND(T168=35,$R$4>=12,$R$4<=16.99),T168&\"-\"&\"2\",0)","v":{"$error":"#N/A"}}]
[null,null,null,null,null,null,null,null,null,null,null,null,null,0,0,{"$f":"IF(AND(O169=35,$M$4>=17,$M$4<=22.99),O169&\"-\"&\"3\",0)","v":0},null,null,{"$error":"#N/A"},{"$error":"#N/A"},{"$f":"IF(AND(T169=35,$R$4>=17,$R$4<=22.99),T169&\"-\"&\"3\",0)","v":{"$error":"#N/A"}}]
[null,null,null,null,null,null,null,null,null,null,null,null,null,{"$f":"IF(AND(O170>0,P170>0),O170,0)","v":0},0,{"$f":"IF(AND(O170=35,$M$4>=23,$M$4<=28.99),O170&\"-\"&\"4\",0)","v":0},null,null,{"$error":"#N/A"},{"$error":"#N/A"},{"$f":"IF(AND(T170=35,$R$4>=23,$R$4<=28.99),T170&\"-\"&\"4\",0)","v":{"$error":"#N/A"}}]
[null,null,null,null,null,null,null,null,null,null,null,null,null,0,0,{"$f":"IF(AND(O171=35,$M$4>=29,$M$4<=33.99),O171&\"-\"&\"5\",0)","v":0},null,null,{"$error":"#N/A"},{"$error":"#N/A"},{"$f":"IF(AND(T171=35,$R$4>=29,$R$4<=33.99),T171&\"-\"&\"5\",0)","v":{"$error":"#N/A"}}]
[null,null,null,null,null,null,null,null,null,null,null,null,null,0,0,{"$f":"IF(AND(O172=35,$M$4>=34,$M$4<=37.99),O172&\"-\"&\"6\",0)","v":0},null,null,{"$error":"#N/A"},{"$error":"#N/A"},{"$f":"IF(AND(T172=35,$R$4>=34,$R$4<=37.99),T172&\"-\"&\"6\",0)","v":{"$error":"#N/A"}}]
[null,null,null,null,null,null,null,null,null,null,null,null,null,0,0,{"$f":"IF(AND(O173=35,$M$4>=38,$M$4<=39.99),O173&\"-\"&\"9\",0)","v":0},null,null,{"$error":"#N/A"},{"$error":"#N/A"},{"$f":"IF(AND(T173=35,$R$4>=38,$R$4<=39.99),T173&\"-\"&\"9\",0)","v":{"$error":"#N/A"}}]
[null,null,null,null,null,null,null,null,null,null,null,null,null,0,0,{"$f":"IF(AND(O174=35,$M$4>=40,$M$4<=42.99),O174&\"-\"&\"12\",0)","v":0},null,null,{"$error":"#N/A"},{"$error":"#N/A"},{"$f":"IF(AND(T174=35,$R$4>=40,$R$4<=42.99),T174&\"-\"&\"12\",0)","v":{"$error":"#N/A"}}]
[null,null,null,null,null,null,null,null,null,null,null,null,null,0,0,{"$f":"IF(AND(O175=35,$M$4>=43,$M$4<=44.99),O175&\"-\"&\"13\",0)","v":0},null,null,{"$error":"#N/A"},{"$error":"#N/A"},{"$f":"IF(AND(T175=35,$R$4>=43,$R$4<=44.99),T175&\"-\"&\"13\",0)","v":{"$error":"#N/A"}}]
[null,null,null,null,null,null,null,null,null,null,null,null,null,0,0,{"$f":"IF(AND(O176=35,$M$4>=45,$M$4<=47.99),O176&\"-\"&\"14\",0)","v":0},null,null,{"$error":"#N/A"},{"$error":"#N/A"},{"$f":"IF(AND(T176=35,$R$4>=45,$R$4<=47.99),T176&\"-\"&\"14\",0)","v":{"$error":"#N/A"}}]
[null,null,null,null,null,null,null,null,null,null,null,null,null,0,0,{"$f":"IF(AND(O177=35,$M$4>=48,$M$4<=50.99),O177&\"-\"&\"15\",0)","v":0},null,null,{"$error":"#N/A"},{"$error":"#N/A"},{"$f":"IF(AND(T177=35,$R$4>=48,$R$4<=50.99),T177&\"-\"&\"15\",0)","v":{"$error":"#N/A"}}]
[null,null,null,null,null,null,null,null,null,null,null,null,null,0,0,{"$f":"IF(AND(O178=35,$M$4>=51,$M$4<=53),O178&\"-\"&\"16\",0)","v":0},null,null,{"$error":"#N/A"},{"$error":"#N/A"},{"$f":"IF(AND(T178=35,$R$4>=51,$R$4<=53),T178&\"-\"&\"16\",0)","v":{"$error":"#N/A"}}]
[null,null,null,null,null,null,null,null,null,null,null,null,null,0,{"$f":"IF(AND($N$4<=37,$N$4>35),37,0)","v":0},{"$f":"IF(AND(O179=37,$M$4>=8,$M$4<=11.99),O179&\"-\"&\"1\",0)","v":0},null,null,{"$error":"#N/A"},{"$f":"IF(AND($S$4<=37,$S$4>35),37,0)","v":{"$error":"#N/A"}},{"$f":"IF(AND(T179=37,$R$4>=8,$R$4<=11.99),T179&\"-\"&\"1\",0)","v":{"$error":"#N/A"}}]
[null,null,null,null,null,null,null,null,null,null,null,null,null,0,0,{"$f":"IF(AND(O180=37,$M$4>=12,$M$4<=16.99),O180&\"-\"&\"2\",0)","v":0},null,null,{"$error":"#N/A"},{"$error":"#N/A"},{"$f":"IF(AND(T180=37,$R$4>=12,$R$4<=16.99),T180&\"-\"&\"2\",0)","v":{"$error":"#N/A"}}]
[null,null,null,null,null,null,null,null,null,null,null,null,null,0,0,{"$f":"IF(AND(O181=37,$M$4>=17,$M$4<=22.99),O181&\"-\"&\"3\",0)","v":0},null,null,{"$error":"#N/A"},{"$error":"#N/A"},{"$f":"IF(AND(T181=37,$R$4>=17,$R$4<=22.99),T181&\"-\"&\"3\",0)","v":{"$error":"#N/A"}}]
[null,null,null,null,null,null,null,null,null,null,null,null,null,0,0,{"$f":"IF(AND(O182=37,$M$4>=23,$M$4<=28.99),O182&\"-\"&\"4\",0)","v":0},null,null,{"$error":"#N/A"},{"$error":"#N/A"},{"$f":"IF(AND(T182=37,$R$4>=23,$R$4<=28.99),T182&\"-\"&\"4\",0)","v":{"$error":"#N/A"}}]
[null,null,null,null,null,null,null,null,null,null,null,null,null,0,0,{"$f":"IF(AND(O183=37,$M$4>=29,$M$4<=33.99),O183&\"-\"&\"5\",0)","v":0},null,null,{"$error":"#N/A"},{"$error":"#N/A"},{"$f":"IF(AND(T183=37,$R$4>=29,$R$4<=33.99),T183&\"-\"&\"5\",0)","v":{"$error":"#N/A"}}]
[null,null,null,null,null,null,null,null,null,null,null,null,null,0,0,{"$f":"IF(AND(O184=37,$M$4>=34,$M$4<=37.99),O184&\"-\"&\"6\",0)","v":0},null,null,{"$error":"#N/A"},{"$error":"#N/A"},{"$f":"IF(AND(T184=37,$R$4>=34,$R$4<=37.99),T184&\"-\"&\"6\",0)","v":{"$error":"#N/A"}}]
[null,null,null,null,null,null,null,null,null,null,null,null,null,0,0,{"$f":"IF(AND(O185=37,$M$4>=38,$M$4<=39.99),O185&\"-\"&\"9\",0)","v":0},null,null,{"$error":"#N/A"},{"$error":"#N/A"},{"$f":"IF(AND(T185=37,$R$4>=38,$R$4<=39.99),T185&\"-\"&\"9\",0)","v":{"$error":"#N/A"}}]
[null,null,null,null,null,null,null,null,null,null,null,null,null,0,0,{"$f":"IF(AND(O186=37,$M$4>=40,$M$4<=42.99),O186&\"-\"&\"12\",0)","v":0},null,null,{"$error":"#N/A"},{"$error":"#N/A"},{"$f":"IF(AND(T186=37,$R$4>=40,$R$4<=42.99),T186&\"-\"&\"12\",0)","v":{"$error":"#N/A"}}]
[null,null,null,null,null,null,null,null,null,null,null,null,null,0,0,{"$f":"IF(AND(O187=37,$M$4>=43,$M$4<=44.99),O187&\"-\"&\"13\",0)","v":0},null,null,{"$error":"#N/A"},{"$error":"#N/A"},{"$f":"IF(AND(T187=37,$R$4>=43,$R$4<=44.99),T187&\"-\"&\"13\",0)","v":{"$error":"#N/A"}}]
[null,null,null,null,null,null,null,null,null,null,null,null,null,0,0,{"$f":"IF(AND(O188=37,$M$4>=45,$M$4<=47.99),O188&\"-\"&\"14\",0)","v":0},null,null,{"$error":"#N/A"},{"$error":"#N/A"},{"$f":"IF(AND(T188=37,$R$4>=45,$R$4<=47.99),T188&\"-\"&\"14\",0)","v":{"$error":"#N/A"}}]
[null,null,null,null,null,null,null,null,null,null,null,null,null,0,0,{"$f":"IF(AND(O189=37,$M$4>=48,$M$4<=50.99),O189&\"-\"&\"15\",0)","v":0},null,null,{"$error":"#N/A"},{"$error":"#N/A"},{"$f":"IF(AND(T189=37,$R$4>=48,$R$4<=50.99),T189&\"-\"&\"15\",0)","v":{"$error":"#N/A"}}]
[null,null,null,null,null,null,null,null,null,null,null,null,null,0,0,{"$f":"IF(AND(O190=37,$M$4>=51,$M$4<=53),O190&\"-\"&\"16\",0)","v":0},null,null,{"$error":"#N/A"},{"$error":"#N/A"},{"$f":"IF(AND(T190=37,$R$4>=51,$R$4<=53),T190&\"-\"&\"16\",0)","v":{"$error":"#N/A"}}]
[null,null,null,null,null,null,null,null,null,null,null,null,null,0,{"$f":"IF(AND($N$4<=39,$N$4>37),39,0)","v":0},{"$f":"IF(AND(O191=39,$M$4>=8,$M$4<=11.99),O191&\"-\"&\"1\",0)","v":0},null,null,{"$error":"#N/A"},{"$f":"IF(AND($S$4<=39,$S$4>37),39,0)","v":{"$error":"#N/A"}},{"$f":"IF(AND(T191=39,$R$4>=8,$R$4<=11.99),T191&\"-\"&\"1\",0)","v":{"$error":"#N/A"}}]
[null,null,null,null,null,null,null,null,null,null,null,null,null,0,0,{"$f":"IF(AND(O192=39,$M$4>=12,$M$4<=16.99),O192&\"-\"&\"2\",0)","v":0},null,null,{"$error":"#N/A"},{"$error":"#N/A"},{"$f":"IF(AND(T192=39,$R$4>=12,$R$4<=16.99),T192&\"-\"&\"2\",0)","v":{"$error":"#N/A"}}]
[null,null,null,null,null,null,null,null,null,null,null,null,null,0,0,{"$f":"IF(AND(O193=39,$M$4>=17,$M$4<=22.99),O193&\"-\"&\"3\",0)","v":0},null,null,{"$error":"#N/A"},{"$error":"#N/A"},{"$f":"IF(AND(T193=39,$R$4>=17,$R$4<=22.99),T193&\"-\"&\"3\",0)","v":{"$error":"#N/A"}}]
[null,null,null,null,null,null,null,null,null,null,null,null,null,0,0,{"$f":"IF(AND(O194=39,$M$4>=23,$M$4<=28.99),O194&\"-\"&\"4\",0)","v":0},null,null,{"$error":"#N/A"},{"$error":"#N/A"},{"$f":"IF(AND(T194=39,$R$4>=23,$R$4<=28.99),T194&\"-\"&\"4\",0)","v":{"$error":"#N/A"}}]
[null,null,null,null,null,null,null,null,null,null,null,null,null,0,0,{"$f":"IF(AND(O195=39,$M$4>=29,$M$4<=33.99),O195&\"-\"&\"5\",0)","v":0},null,null,{"$error":"#N/A"},{"$error":"#N/A"},{"$f":"IF(AND(T195=39,$R$4>=29,$R$4<=33.99),T195&\"-\"&\"5\",0)","v":{"$error":"#N/A"}}]
[null,null,null,null,null,null,null,null,null,null,null,null,null,0,0,{"$f":"IF(AND(O196=39,$M$4>=34,$M$4<=37.99),O196&\"-\"&\"6\",0)","v":0},null,null,{"$error":"#N/A"},{"$error":"#N/A"},{"$f":"IF(AND(T196=39,$R$4>=34,$R$4<=37.99),T196&\"-\"&\"6\",0)","v":{"$error":"#N/A"}}]
[null,null,null,null,null,null,null,null,null,null,null,null,null,0,0,{"$f":"IF(AND(O197=39,$M$4>=38,$M$4<=39.99),O197&\"-\"&\"9\",0)","v":0},null,null,{"$f":"IF(AND(T197>0,U197>0),T197,0)","v":{"$error":"#N/A"}},{"$error":"#N/A"},{"$f":"IF(AND(T197=39,$R$4>=38,$R$4<=39.99),T197&\"-\"&\"9\",0)","v":{"$error":"#N/A"}}]
[null,null,null,null,null,null,null,null,null,null,null,null,null,0,0,{"$f":"IF(AND(O198=39,$M$4>=40,$M$4<=42.99),O198&\"-\"&\"12\",0)","v":0},null,null,{"$error":"#N/A"},{"$error":"#N/A"},{"$f":"IF(AND(T198=39,$R$4>=40,$R$4<=42.99),T198&\"-\"&\"12\",0)","v":{"$error":"#N/A"}}]
[null,null,null,null,null,null,null,null,null,null,null,null,null,0,0,{"$f":"IF(AND(O199=39,$M$4>=43,$M$4<=44.99),O199&\"-\"&\"13\",0)","v":0},null,null,{"$error":"#N/A"},{"$error":"#N/A"},{"$f":"IF(AND(T199=39,$R$4>=43,$R$4<=44.99),T199&\"-\"&\"13\",0)","v":{"$error":"#N/A"}}]
[null,null,null,null,null,null,null,null,null,null,null,null,null,0,0,{"$f":"IF(AND(O200=39,$M$4>=45,$M$4<=47.99),O200&\"-\"&\"14\",0)","v":0},null,null,{"$error":"#N/A"},{"$error":"#N/A"},{"$f":"IF(AND(T200=39,$R$4>=45,$R$4<=47.99),T200&\"-\"&\"14\",0)","v":{"$error":"#N/A"}}]
[null,null,null,null,null,null,null,null,null,null,null,null,null,0,0,{"$f":"IF(AND(O201=39,$M$4>=48,$M$4<=50.99),O201&\"-\"&\"15\",0)","v":0},null,null,{"$error":"#N/A"},{"$error":"#N/A"},{"$f":"IF(AND(T201=39,$R$4>=48,$R$4<=50.99),T201&\"-\"&\"15\",0)","v":{"$error":"#N/A"}}]
[null,null,null,null,null,null,null,null,null,null,null,null,null,0,0,{"$f":"IF(AND(O202=39,$M$4>=51,$M$4<=53),O202&\"-\"&\"16\",0)","v":0},null,null,{"$error":"#N/A"},{"$error":"#N/A"},{"$f":"IF(AND(T202=39,$R$4>=51,$R$4<=53),T202&\"-\"&\"16\",0)","v":{"$error":"#N/A"}}]
[null,null,null,null,null,null,null,null,null,null,null,null,null,0,{"$f":"IF(AND($N$4<=41,$N$4>39),41,0)","v":0},{"$f":"IF(AND(O203=41,$M$4>=9,$M$4<=12.99),O203&\"-\"&\"1\",0)","v":0},null,null,{"$error":"#N/A"},{"$f":"IF(AND($S$4<=41,$S$4>39),41,0)","v":{"$error":"#N/A"}},{"$f":"IF(AND(T203=41,$R$4>=9,$R$4<=12.99),T203&\"-\"&\"1\",0)","v":{"$error":"#N/A"}}]
[null,null,null,null,null,null,null,null,null,null,null,null,null,0,0,{"$f":"IF(AND(O204=41,$M$4>=13,$M$4<=17.99),O204&\"-\"&\"2\",0)","v":0},null,null,{"$error":"#N/A"},{"$error":"#N/A"},{"$f":"IF(AND(T204=41,$R$4>=13,$R$4<=17.99),T204&\"-\"&\"2\",0)","v":{"$error":"#N/A"}}]
[null,null,null,null,null,null,null,null,null,null,null,null,null,0,0,{"$f":"IF(AND(O205=41,$M$4>=18,$M$4<=23.99),O205&\"-\"&\"3\",0)","v":0},null,null,{"$error":"#N/A"},{"$error":"#N/A"},{"$f":"IF(AND(T205=41,$R$4>=18,$R$4<=23.99),T205&\"-\"&\"3\",0)","v":{"$error":"#N/A"}}]
[null,null,null,null,null,null,null,null,null,null,null,null,null,0,0,{"$f":"IF(AND(O206=41,$M$4>=24,$M$4<=28.99),O206&\"-\"&\"4\",0)","v":0},null,null,{"$error":"#N/A"},{"$error":"#N/A"},{"$f":"IF(AND(T206=41,$R$4>=24,$R$4<=28.99),T206&\"-\"&\"4\",0)","v":{"$error":"#N/A"}}]
[null,null,null,null,null,null,null,null,null,null,null,null,null,0,0,{"$f":"IF(AND(O207=41,$M$4>=29,$M$4<=34.99),O207&\"-\"&\"5\",0)","v":0},null,null,{"$error":"#N/A"},{"$error":"#N/A"},{"$f":"IF(AND(T207=41,$R$4>=29,$R$4<=34.99),T207&\"-\"&\"5\",0)","v":{"$error":"#N/A"}}]
[null,null,null,null,null,null,null,null,null,null,null,null,null,0,0,{"$f":"IF(AND(O208=41,$M$4>=35,$M$4<=38.99),O208&\"-\"&\"6\",0)","v":0},null,null,{"$error":"#N/A"},{"$error":"#N/A"},{"$f":"IF(AND(T208=41,$R$4>=35,$R$4<=38.99),T208&\"-\"&\"6\",0)","v":{"$error":"#N/A"}}]
[null,null,null,null,null,null,null,null,null,null,null,null,null,0,0,{"$f":"IF(AND(O209=41,$M$4>=39,$M$4<=41.99),O209&\"-\"&\"9\",0)","v":0},null,null,{"$error":"#N/A"},{"$error":"#N/A"},{"$f":"IF(AND(T209=41,$R$4>=39,$R$4<=41.99),T209&\"-\"&\"9\",0)","v":{"$error":"#N/A"}}]
[null,null,null,null,null,null,null,null,null,null,null,null,null,0,0,{"$f":"IF(AND(O210=41,$M$4>=42,$M$4<=44.99),O210&\"-\"&\"12\",0)","v":0},null,null,{"$error":"#N/A"},{"$error":"#N/A"},{"$f":"IF(AND(T210=41,$R$4>=42,$R$4<=44.99),T210&\"-\"&\"12\",0)","v":{"$error":"#N/A"}}]
[null,null,null,null,null,null,null,null,null,null,null,null,null,0,0,{"$f":"IF(AND(O211=41,$M$4>=45,$M$4<=47.99),O211&\"-\"&\"13\",0)","v":0},null,null,{"$error":"#N/A"},{"$error":"#N/A"},{"$f":"IF(AND(T211=41,$R$4>=45,$R$4<=47.99),T211&\"-\"&\"13\",0)","v":{"$error":"#N/A"}}]
[null,null,null,null,null,null,null,null,null,null,null,null,null,0,0,{"$f":"IF(AND(O212=41,$M$4>=48,$M$4<=50.99),O212&\"-\"&\"14\",0)","v":0},null,null,{"$error":"#N/A"},{"$error":"#N/A"},{"$f":"IF(AND(T212=41,$R$4>=48,$R$4<=50.99),T212&\"-\"&\"14\",0)","v":{"$error":"#N/A"}}]
[null,null,null,null,null,null,null,null,null,null,null,null,null,0,0,{"$f":"IF(AND(O213=41,$M$4>=51,$M$4<=53),O213&\"-\"&\"15\",0)","v":0},null,null,{"$error":"#N/A"},{"$error":"#N/A"},{"$f":"IF(AND(T213=41,$R$4>=51,$R$4<=53),T213&\"-\"&\"15\",0)","v":{"$error":"#N/A"}}]
[null,null,null,null,null,null,null,null,null,null,null,null,null,0,{"$f":"IF(AND($N$4<=43,$N$4>41),43,0)","v":0},{"$f":"IF(AND(O214=43,$M$4>=9,$M$4<=12.99),O214&\"-\"&\"1\",0)","v":0},null,null,{"$error":"#N/A"},{"$f":"IF(AND($S$4<=43,$S$4>41),43,0)","v":{"$error":"#N/A"}},{"$f":"IF(AND(T214=43,$R$4>=9,$R$4<=12.99),T214&\"-\"&\"1\",0)","v":{"$error":"#N/A"}}]
[null,null,null,null,null,null,null,null,null,null,null,null,null,0,0,{"$f":"IF(AND(O215=43,$M$4>=13,$M$4<=17.99),O215&\"-\"&\"2\",0)","v":0},null,null,{"$error":"#N/A"},{"$error":"#N/A"},{"$f":"IF(AND(T215=43,$R$4>=13,$R$4<=17.99),T215&\"-\"&\"2\",0)","v":{"$error":"#N/A"}}]
[null,null,null,null,null,null,null,null,null,null,null,null,null,0,0,{"$f":"IF(AND(O216=43,$M$4>=18,$M$4<=23.99),O216&\"-\"&\"3\",0)","v":0},null,null,{"$error":"#N/A"},{"$error":"#N/A"},{"$f":"IF(AND(T216=43,$R$4>=18,$R$4<=23.99),T216&\"-\"&\"3\",0)","v":{"$error":"#N/A"}}]
[null,null,null,null,null,null,null,null,null,null,null,null,null,0,0,{"$f":"IF(AND(O217=43,$M$4>=24,$M$4<=28.99),O217&\"-\"&\"4\",0)","v":0},null,null,{"$error":"#N/A"},{"$error":"#N/A"},{"$f":"IF(AND(T217=43,$R$4>=24,$R$4<=28.99),T217&\"-\"&\"4\",0)","v":{"$error":"#N/A"}}]
[null,null,null,null,null,null,null,null,null,null,null,null,null,0,0,{"$f":"IF(AND(O218=43,$M$4>=29,$M$4<=34.99),O218&\"-\"&\"5\",0)","v":0},null,null,{"$error":"#N/A"},{"$error":"#N/A"},{"$f":"IF(AND(T218=43,$R$4>=29,$R$4<=34.99),T218&\"-\"&\"5\",0)","v":{"$error":"#N/A"}}]
[null,null,null,null,null,null,null,null,null,null,null,null,null,0,0,{"$f":"IF(AND(O219=43,$M$4>=35,$M$4<=38.99),O219&\"-\"&\"6\",0)","v":0},null,null,{"$error":"#N/A"},{"$error":"#N/A"},{"$f":"IF(AND(T219=43,$R$4>=35,$R$4<=38.99),T219&\"-\"&\"6\",0)","v":{"$error":"#N/A"}}]
[null,null,null,null,null,null,null,null,null,null,null,null,null,0,0,{"$f":"IF(AND(O220=43,$M$4>=39,$M$4<=41.99),O220&\"-\"&\"9\",0)","v":0},null,null,{"$error":"#N/A"},{"$error":"#N/A"},{"$f":"IF(AND(T220=43,$R$4>=39,$R$4<=41.99),T220&\"-\"&\"9\",0)","v":{"$error":"#N/A"}}]
[null,null,null,null,null,null,null,null,null,null,null,null,null,0,0,{"$f":"IF(AND(O221=43,$M$4>=42,$M$4<=44.99),O221&\"-\"&\"12\",0)","v":0},null,null,{"$error":"#N/A"},{"$error":"#N/A"},{"$f":"IF(AND(T221=43,$R$4>=42,$R$4<=44.99),T221&\"-\"&\"12\",0)","v":{"$error":"#N/A"}}]
[null,null,null,null,null,null,null,null,null,null,null,null,null,0,0,{"$f":"IF(AND(O222=43,$M$4>=45,$M$4<=47.99),O222&\"-\"&\"13\",0)","v":0},null,null,{"$error":"#N/A"},{"$error":"#N/A"},{"$f":"IF(AND(T222=43,$R$4>=45,$R$4<=47.99),T222&\"-\"&\"13\",0)","v":{"$error":"#N/A"}}]
[null,null,null,null,null,null,null,null,null,null,null,null,null,0,0,{"$f":"IF(AND(O223=43,$M$4>=48,$M$4<=50.99),O223&\"-\"&\"14\",0)","v":0},null,null,{"$error":"#N/A"},{"$error":"#N/A"},{"$f":"IF(AND(T223=43,$R$4>=48,$R$4<=50.99),T223&\"-\"&\"14\",0)","v":{"$error":"#N/A"}}]
[null,null,null,null,null,null,null,null,null,null,null,null,null,0,0,{"$f":"IF(AND(O224=43,$M$4>=51,$M$4<=53),O224&\"-\"&\"15\",0)","v":0},null,null,{"$error":"#N/A"},{"$error":"#N/A"},{"$f":"IF(AND(T224=43,$R$4>=51,$R$4<=53),T224&\"-\"&\"15\",0)","v":{"$error":"#N/A"}}]
[null,null,null,null,null,null,null,null,null,null,null,null,null,0,{"$f":"IF(AND($N$4<=45,$N$4>43),45,0)","v":0},{"$f":"IF(AND(O225=45,$M$4>=9,$M$4<=12.99),O225&\"-\"&\"1\",0)","v":0},null,null,{"$error":"#N/A"},{"$f":"IF(AND($S$4<=45,$S$4>43),45,0)","v":{"$error":"#N/A"}},{"$f":"IF(AND(T225=45,$R$4>=9,$R$4<=12.99),T225&\"-\"&\"1\",0)","v":{"$error":"#N/A"}}]
[null,null,null,null,null,null,null,null,null,null,null,null,null,0,0,{"$f":"IF(AND(O226=45,$M$4>=13,$M$4<=17.99),O226&\"-\"&\"2\",0)","v":0},null,null,{"$error":"#N/A"},{"$error":"#N/A"},{"$f":"IF(AND(T226=45,$R$4>=13,$R$4<=17.99),T226&\"-\"&\"2\",0)","v":{"$error":"#N/A"}}]
[null,null,null,null,null,null,null,null,null,null,null,null,null,0,0,{"$f":"IF(AND(O227=45,$M$4>=18,$M$4<=23.99),O227&\"-\"&\"3\",0)","v":0},null,null,{"$error":"#N/A"},{"$error":"#N/A"},{"$f":"IF(AND(T227=45,$R$4>=18,$R$4<=23.99),T227&\"-\"&\"3\",0)","v":{"$error":"#N/A"}}]
[null,null,null,null,null,null,null,null,null,null,null,null,null,0,0,{"$f":"IF(AND(O228=45,$M$4>=24,$M$4<=28.99),O228&\"-\"&\"4\",0)","v":0},null,null,{"$error":"#N/A"},{"$error":"#N/A"},{"$f":"IF(AND(T228=45,$R$4>=24,$R$4<=28.99),T228&\"-\"&\"4\",0)","v":{"$error":"#N/A"}}]
[null,null,null,null,null,null,null,null,null,null,null,null,null,0,0,{"$f":"IF(AND(O229=45,$M$4>=29,$M$4<=34.99),O229&\"-\"&\"5\",0)","v":0},null,null,{"$error":"#N/A"},{"$error":"#N/A"},{"$f":"IF(AND(T229=45,$R$4>=29,$R$4<=34.99),T229&\"-\"&\"5\",0)","v":{"$error":"#N/A"}}]
[null,null,null,null,null,null,null,null,null,null,null,null,null,0,0,{"$f":"IF(AND(O230=45,$M$4>=35,$M$4<=38.99),O230&\"-\"&\"6\",0)","v":0},null,null,{"$error":"#N/A"},{"$error":"#N/A"},{"$f":"IF(AND(T230=45,$R$4>=35,$R$4<=38.99),T230&\"-\"&\"6\",0)","v":{"$error":"#N/A"}}]
[null,null,null,null,null,null,null,null,null,null,null,null,null,0,0,{"$f":"IF(AND(O231=45,$M$4>=39,$M$4<=41.99),O231&\"-\"&\"9\",0)","v":0},null,null,{"$error":"#N/A"},{"$error":"#N/A"},{"$f":"IF(AND(T231=45,$R$4>=39,$R$4<=41.99),T231&\"-\"&\"9\",0)","v":{"$error":"#N/A"}}]
[null,null,null,null,null,null,null,null,null,null,null,null,null,0,0,{"$f":"IF(AND(O232=45,$M$4>=42,$M$4<=44.99),O232&\"-\"&\"12\",0)","v":0},null,null,{"$error":"#N/A"},{"$error":"#N/A"},{"$f":"IF(AND(T232=45,$R$4>=42,$R$4<=44.99),T232&\"-\"&\"12\",0)","v":{"$error":"#N/A"}}]
[null,null,null,null,null,null,null,null,null,null,null,null,null,0,0,{"$f":"IF(AND(O233=45,$M$4>=45,$M$4<=47.99),O233&\"-\"&\"13\",0)","v":0},null,null,{"$error":"#N/A"},{"$error":"#N/A"},{"$f":"IF(AND(T233=45,$R$4>=45,$R$4<=47.99),T233&\"-\"&\"13\",0)","v":{"$error":"#N/A"}}]
[null,null,null,null,null,null,null,null,null,null,null,null,null,{"$f":"IF(AND(O234>0,P234>0),O234,0)","v":0},0,{"$f":"IF(AND(O234=45,$M$4>=48,$M$4<=50.99),O234&\"-\"&\"14\",0)","v":0},null,null,{"$error":"#N/A"},{"$error":"#N/A"},{"$f":"IF(AND(T234=45,$R$4>=48,$R$4<=50.99),T234&\"-\"&\"14\",0)","v":{"$error":"#N/A"}}]
[null,null,null,null,null,null,null,null,null,null,null,null,null,0,0,{"$f":"IF(AND(O235=45,$M$4>=51,$M$4<=53),O235&\"-\"&\"15\",0)","v":0},null,null,{"$error":"#N/A"},{"$error":"#N/A"},{"$f":"IF(AND(T235=45,$R$4>=51,$R$4<=53),T235&\"-\"&\"15\",0)","v":{"$error":"#N/A"}}]

{"sheet":"Tables","index":2,"n_rows":40,"n_cols":30,"rows_kept":40,"cut":false,"hidden":true,"merged":[[14,15,14,20]]}
[null,"S140 / S144 / S146 Calculations"]
[null,"Frame Cut Leg",{"$f":"LEG+6","v":6},null,null,null,"CDIM","DDIM","SashW","SashH","GlassW","GlassH","Radius","Weight","Deduct","Astragal","Screen W","Screen H","Balance",null,null,null,null,null,null,null,"Glass Strength"]
[null,"CMRD",{"$f":"Frame_Height-C2","v":-6},null,null,"Mezzo",{"$f":"CDIM_A140","v":0},{"$f":"DDIM_A140","v":6},{"$f":"BSW_03S0","v":-3.125},{"$f":"CDIM_A140-1.125","v":-1.125},{"$f":"I3-1.6875","v":-4.8125},{"$f":"J3-1.625","v":-2.75},12.5,{"$f":"BWGT_03S0","v":{"$error":"#VALUE!"}},0.26400000000000001,{"$f":"AST_03S0","v":-3.9375},{"$f":"Frame_Width-4.5","v":-4.5},{"$f":"CDIM_A140-1.3125","v":-1.3125},{"$f":"IF(ISERROR((VLOOKUP(BTM_WGT,CFB,2,FALSE))),\"N/A\",(VLOOKUP(BTM_WGT,CFB,2,FALSE)))","v":"N/A"},null,null,null,null,1,{"$f":"IF(AA3>\"\",VLOOKUP(AA3,GLASSLOOKUP,2,FALSE),\"\")","v":""},{"$f":"IF(AA3>\"\",VLOOKUP(Y3,WEIGHTCHART,2,FALSE),\"\")","v":""},{"$f":"GLASS1","v":""},null,null,"Extrusion"]
[null,"F",{"$f":"2*(ASIN((Offset*2)/(2*C10)))","v":{"$error":"#DIV/0!"}},null,null,"Mezzo/N.F",0,6,{"$f":"BSW_03S0","v":-3.125},{"$f":"CDIM_A140-1.125","v":-1.125},{"$f":"I4-1.6875","v":-4.8125},{"$f":"J4-1.625","v":-2.75},13,{"$f":"BWGT_03S0","v":{"$error":"#VALUE!"}},0.26400000000000001,{"$f":"AST_03S0","v":-3.9375},{"$f":"Frame_Width-4.5","v":-4.5},{"$f":"CDIM_A140-1.3125","v":-1.3125},{"$f":"IF(ISERROR((VLOOKUP(BTM_WGT,CFB,2,FALSE))),\"N/A\",(VLOOKUP(BTM_WGT,CFB,2,FALSE)))","v":"N/A"},null,null,null,null,2,"","",{"$f":"GLASS2","v":""},null,1,{"$f":"IF(EXT_1=0,\"\",EXT_1)","v":""}]
[null,"d",{"$f":"C10*COS(C4/2)","v":{"$error":"#DIV/0!"}},null,null,"Mezzo w/Stucco",0,6,{"$f":"BSW_03S0","v":-3.125},{"$f":"CDIM_A140-1.125","v":-1.125},{"$f":"Frame_Width-4","v":-4},{"$f":"CDIM_A140-1.5625","v":-1.5625},13.5,{"$f":"BWGT_03S0","v":{"$error":"#VALUE!"}},0.26400000000000001,{"$f":"AST_03S0","v":-3.9375},{"$f":"Frame_Width-4.5","v":-4.5},{"$f":"CDIM_A140-1.3125","v":-1.3125},{"$f":"IF(ISERROR((VLOOKUP(BTM_WGT,CFB,2,FALSE))),\"N/A\",(VLOOKUP(BTM_WGT,CFB,2,FALSE)))","v":"N/A"},null,null,null,null,3,"","",{"$f":"GLASS3","v":""},null,2,{"$f":"IF(EXT_2=0,\"\",EXT_2)","v":""}]
[null,"h",{"$f":"C10-C5","v":{"$error":"#DIV/0!"}},null,null,"80s 1-3/8\" NFS",0,6,{"$f":"BSW_A581","v":-2.8125},{"$f":"CDIM_A840-1.5","v":-1.5},{"$f":"I6-2.5625","v":-5.375},{"$f":"J6-2.5625","v":-4.0625},11.75,{"$f":"BWGT_A581","v":{"$error":"#VALUE!"}},0.71875,{"$f":"AST_A581","v":-2.0625},{"$f":"Frame_Width-2.375","v":-2.375},{"$f":"CDIM_A840-2","v":-2},{"$f":"IF(ISERROR(BTM_TUBE),\"N/A\",BTM_TUBE)","v":"N/A"},null,null,null,null,4,"","",{"$f":"GLASS4","v":""},null,3,{"$f":"IF(EXT_3=0,\"\",EXT_3)","v":""}]
[null,null,{"$f":"IF(OR(ModelNo=\"A146\",ModelNo=\"A746\",ModelNo=\"A846\"),((Frame_Height-LEG)/2)+(((Frame_Width*2)^2)/(8*(Frame_Height-LEG))),((Frame_Height-LEG)/2)+((Frame_Width^2)/(8*(Frame_Height-LEG))))","v":{"$error":"#DIV/0!"}},null,null,"80s 1\" NFS",0,6,{"$f":"BSW_A581","v":-2.8125},{"$f":"CDIM_A840-1.5","v":-1.5},{"$f":"I7-2.5625","v":-5.375},{"$f":"J7-2.5625","v":-4.0625},11.75,{"$f":"BWGT_A581","v":{"$error":"#VALUE!"}},0.71875,{"$f":"AST_A581","v":-2.0625},{"$f":"Frame_Width-2.375","v":-2.375},{"$f":"CDIM_A840-2","v":-2},"N/A",null,null,null,null,5,"","",{"$f":"GLASS5","v":""},null,4,{"$f":"IF(EXT_4=0,\"\",EXT_4)","v":""}]
[null,"Top Glass Width",{"$f":"TRUNC((Frame_Width-2*EXT)*16+0.5)/16","v":0},null,null,"80s Flush Fin",0,6,{"$f":"BSW_A581","v":-2.8125},{"$f":"CDIM_A840-1.5","v":-1.5},-5.375,-4.0625,11.75,{"$f":"BWGT_A581","v":{"$error":"#VALUE!"}},0.71875,{"$f":"AST_A581","v":-2.0625},{"$f":"Frame_Width-2.375","v":-2.375},{"$f":"CDIM_A840-2","v":-2},"N/A",null,null,null,null,6,"","",{"$f":"GLASS6","v":""},null,5,{"$f":"IF(EXT_5=0,\"\",EXT_5)","v":""}]
[null,"Top Glass Height",{"$f":"IF(OR(ModelNo=\"A146\",ModelNo=\"A746\",ModelNo=\"A846\"),Frame_Height-($C$15+$C$12+EXT+C6),Frame_Height-($C$15+C12+EXT))","v":0},null,null,"70s 1-3/8\" NFS",0,6,{"$f":"BSW_A571","v":-2.125},{"$f":"CDIM_A740-0.875","v":-0.875},{"$f":"I9-2.1875","v":-4.3125},-3.0625,11.75,{"$f":"BWGT_A571","v":{"$error":"#VALUE!"}},0.6875,{"$f":"AST_A571","v":-1.8125},{"$f":"Frame_Width-2.125","v":-2.125},{"$f":"CDIM_A740-1.8125","v":-1.8125},"N/A",null,null,null,null,7,"","",{"$f":"GLASS7","v":""},null,"EXTSELECT",1]
[null,"Glass R:",{"$f":"FrameR-EXT","v":{"$error":"#DIV/0!"}},null,null,"70s 7/8\" NFS",0,6,{"$f":"BSW_A571","v":-2.125},{"$f":"CDIM_A740-0.875","v":-0.875},-4.3125,-3.0625,11.75,{"$f":"BWGT_A571","v":{"$error":"#VALUE!"}},0.6875,{"$f":"AST_A571","v":-1.8125},{"$f":"Frame_Width-2.125","v":-2.125},{"$f":"CDIM_A740-1.8125","v":-1.8125},"N/A",null,null,null,null,8,"","",{"$f":"GLASS8","v":""},null,"EXT",{"$f":"Offset","v":0}]
[null," Glass h:",{"$f":"IF(OR(ModelNo=\"A146\",ModelNo=\"A746\",ModelNo=\"A846\"),C10-(SQRT((4*C10^2)-(C8*2+(2*EXT))^2))/2,C10-(SQRT((4*C10^2)-(C8)^2)/2))","v":{"$error":"#DIV/0!"}},null,null,"70s J-Channel",0,6,{"$f":"BSW_A571","v":-2.125},{"$f":"CDIM_A740-0.875","v":-0.875},-4.3125,-3.0625,11.75,{"$f":"BWGT_A571","v":{"$error":"#VALUE!"}},0.6875,{"$f":"AST_A571","v":-1.8125},{"$f":"Frame_Width-2.125","v":-2.125},{"$f":"CDIM_A740-1.8125","v":-1.8125},"N/A",null,null,null,null,null,null,null,1,null,"EXTTYPE",{"$f":"VLOOKUP(EXTSELECT,AC4:AD8,2,FALSE)","v":""}]
[null,"Deduct",{"$f":"O13","v":0},null,null,"70s Flush Fin",0,6,{"$f":"BSW_A571","v":-2.125},{"$f":"CDIM_A740-0.875","v":-0.875},-4.3125,-3.0625,11.75,{"$f":"BWGT_A571","v":{"$error":"#VALUE!"}},0.6875,{"$f":"AST_A571","v":-1.8125},{"$f":"Frame_Width-2.125","v":-2.125},{"$f":"CDIM_A740-1.8125","v":-1.8125},"N/A",null,null,null,null,null,null,{"$f":"VLOOKUP(GT,Y3:Z10,2,FALSE)","v":""},{"$f":"VLOOKUP(Glass,X3:Z10,2,FALSE)","v":""}]
[null,"Top Glass Leg:",{"$f":"IF(OR(ModelNo=\"A146\",ModelNo=\"A746\",ModelNo=\"A846\"),C9-C11+C6,C9-C11)","v":{"$error":"#DIV/0!"}},null,null,{"$f":"EXTTYPE","v":""},{"$f":"IF(EXTSELECT>1,VLOOKUP(EXTTYPE,F3:S12,2,FALSE),0)","v":0},{"$f":"IF(EXTSELECT>1,VLOOKUP(EXTTYPE,F3:S12,3,FALSE),0)","v":0},{"$f":"IF(EXTSELECT>1,VLOOKUP(EXTTYPE,F3:S12,4,FALSE),0)","v":0},{"$f":"IF(EXTSELECT>1,VLOOKUP(EXTTYPE,F3:S12,5,FALSE),0)","v":0},{"$f":"IF(EXTSELECT>1,VLOOKUP(EXTTYPE,F3:S12,6,FALSE),0)","v":0},{"$f":"IF(EXTSELECT>1,VLOOKUP(EXTTYPE,F3:S12,7,FALSE),0)","v":0},{"$f":"IF(EXTSELECT>1,VLOOKUP(EXTTYPE,F3:S12,8,FALSE),0)","v":0},{"$f":"IF(EXTSELECT>1,VLOOKUP(EXTTYPE,F3:S12,9,FALSE),0)","v":0},{"$f":"IF(EXTSELECT>1,VLOOKUP(EXTTYPE,F3:S12,10,FALSE),0)","v":0},{"$f":"IF(EXTSELECT>1,VLOOKUP(EXTTYPE,F3:S12,11,FALSE),0)","v":0},{"$f":"IF(EXTSELECT>1,VLOOKUP(EXTTYPE,F3:S12,12,FALSE),0)","v":0},{"$f":"IF(EXTSELECT>1,VLOOKUP(EXTTYPE,F3:S12,13,FALSE),0)","v":0},{"$f":"IF(EXTSELECT>1,VLOOKUP(EXTTYPE,F3:S12,14,FALSE),0)","v":0}]
[null,"DDIM_S140",{"$f":"IF(TYPE=1,(Frame_Height/2)-CMRD,IF(TYPE=2,CMR-CMRD))","v":6}]
[null,"CDIM_S140",{"$f":"C2-DDIM_A140","v":0},null,null,null,null,null,null,null,null,null,null,null,false,"AC SASH CALCULATOR"]
[null,null,null,null,null,null,null,null,null,null,null,null,null,null,"Model","Head+4.5","Sill","Center of Ast.","Sash Width","Sash Height","CMR"]
[null,null,null,null,null,null,null,"Moel","GW","GH",null,"Max Short",null,null,{"$f":"ModelNo","v":"Select Model"},{"$f":"IF(ISERROR(VLOOKUP(ModelNo,ACTABLE,2,FALSE)),\"\",VLOOKUP(ModelNo,ACTABLE,2,FALSE))","v":""},{"$f":"IF(ISERROR(VLOOKUP(ModelNo,ACTABLE,3,FALSE)),\"\",VLOOKUP(ModelNo,ACTABLE,3,FALSE))","v":""},{"$f":"IF(ISERROR(VLOOKUP(ModelNo,ACTABLE,4,FALSE)),\"\",VLOOKUP(ModelNo,ACTABLE,4,FALSE))","v":""},{"$f":"IF(ISERROR(VLOOKUP(ModelNo,ACTABLE,5,FALSE)),\"\",VLOOKUP(ModelNo,ACTABLE,5,FALSE))","v":""},{"$f":"IF(ISERROR(VLOOKUP(ModelNo,ACTABLE,6,FALSE)),\"\",VLOOKUP(ModelNo,ACTABLE,6,FALSE))","v":""},{"$f":"IF(ISERROR(VLOOKUP(ModelNo,ACTABLE,7,FALSE)),\"\",VLOOKUP(ModelNo,ACTABLE,7,FALSE))","v":""}]
[null,"SASHSTOP3001",null,null,null,"Type",null,"A270",{"$f":"Frame_Width-2.3125","v":-2.3125},{"$f":"Frame_Height-2.3125","v":-2.3125},{"$f":"MAX(I18:J18)","v":-2.3125},86.25,null,null,"3A01",2.0625,1.875,null,{"$f":"Frame_Width-4.125","v":-4.125},{"$f":"INT((Frame_Height-(P18+Q18+0.5+ACHEIGHT))*16+0.5)/16","v":-4.4375}]
[null,{"$f":"IF(TSH_3A01<CDIM_3A01-1.875,CDIM_3A01-TSH_3A01+11-0.875,0)","v":0},null,null,1,{"$f":"IF(TYPE1>\"\",TYPE1,\"\")","v":""},null,"A570",{"$f":"Frame_Width-2.3125","v":-2.3125},{"$f":"Frame_Height-2.3125","v":-2.3125},{"$f":"MAX(I19:J19)","v":-2.3125},86.25,null,null,"03S0",null,1.875,1.25,{"$f":"BSW_03S0","v":-3.125},null,{"$f":"Frame_Height-(INT((Frame_Height-(Q19+0.5+ACHEIGHT+R19))*16+0.5)/16)","v":3.625}]
[null,{"$f":"IF(TSH_3A01<(CDIM_3A01-1.875),0,IF(CDIM_3A01<=39,7,0))","v":7},null,null,2,{"$f":"IF(TYPE2>\"\",TYPE2,\"\")","v":""},null,"A770",{"$f":"Frame_Width-2.3125","v":-2.3125},{"$f":"Frame_Height-2.3125","v":-2.3125},-2.3125,86.25,null,null,"A571",null,1.4375,null,{"$f":"BSW_A571","v":-2.125},null,1.9375]
[null,{"$f":"IF(TSH_3A01<(CDIM_3A01-1.875),0,IF(AND(CDIM_3A01>39,CDIM_3A01<=42),10,0))","v":0},null,null,3,{"$f":"IF(TYPE3>\"\",TYPE3,\"\")","v":""},null,"A280",{"$f":"Frame_Width-2.5625","v":-2.5625},{"$f":"Frame_Height-2.5625","v":-2.5625},-2.5625,86.5,null,null,"A581",null,1.75,0.3125,{"$f":"BSW_A581","v":-2.8125},null,2.5625]
[null,{"$f":"IF(TSH_3A01<(CDIM_3A01-1.875),0,IF(AND(CDIM_3A01>42,CDIM_3A01<=45),13,0))","v":0},null,null,null,null,null,"A580",{"$f":"Frame_Width-2.5625","v":-2.5625},{"$f":"Frame_Height-2.5625","v":-2.5625},-2.5625,86.5,null,null,"A140",null,1.875,1.25,{"$f":"BSW_A140","v":-3.125},null,3.625]
[null,{"$f":"IF(TSH_3A01<(CDIM_3A01-1.875),0,IF(AND(CDIM_3A01>45,CDIM_3A01<=48),16,0))","v":0},null,null,1,{"$f":"VLOOKUP(TYPE,E19:F22,2,FALSE)","v":""},null,"A780",{"$f":"Frame_Width-2.5625","v":-2.5625},{"$f":"Frame_Height-2.5625","v":-2.5625},-2.5625,86.5,null,null,"A144",null,1.875,1.25,{"$f":"BSW_A140","v":-3.125},null,3.625]
[null,{"$f":"MAX(B19:B23)","v":7},null,null,null,null,null,"A680",{"$f":"MAX(GW1_A680,GW2_A680)","v":-4.125},{"$f":"MAX(GH1_A680,GH2_A680,GH3_A680)","v":-4.125},-4.125,88,null,null,"A146",null,1.875,1.25,{"$f":"BSW_A140","v":-3.125},null,3.625]
[null,null,null,null,null,"Opening",null,"A17A",{"$f":"Frame_Width-2","v":-2},{"$f":"Frame_Height-5.75","v":-5.75},-2,86,null,null,"A740",null,1.4375,1,{"$f":"BSW_A740","v":-2.125},null,2.9375]
[null,"SHAT Error",null,null,1,"Exact Size",null,"A171",{"$f":"Frame_Width-2","v":-2},{"$f":"Frame_Height-2","v":-2},-2,86,null,null,"A744",null,1.4375,1,{"$f":"BSW_A740","v":-2.125},null,2.9375]
[null,{"$f":"IF(ISERROR(EH<6),0,IF(AND(OR(ModelNo=\"A140\",ModelNo=\"A144\",ModelNo=\"A146\",ModelNo=\"A740\",ModelNo=\"A744\",ModelNo=\"A746\",ModelNo=\"A840\",ModelNo=\"A844\",ModelNo=\"A846\"),EH<6,W>0,H>0,LEG>0),1,0))","v":0},null,null,2,"Rough Opening",null,"3A04",{"$f":"Frame_Width-4.1875","v":-4.1875},{"$f":"Frame_Height-4.1875","v":-4.1875},-4.1875,88,null,null,"A746",null,1.4375,1,{"$f":"BSW_A740","v":-2.125},null,2.9375]
[null,"SHAT_MIN_R",null,null,1,{"$f":"VLOOKUP(RO,E26:F27,2,FALSE)","v":"Exact Size"},null,"03S4",{"$f":"Frame_Width-4.1875","v":-4.1875},{"$f":"Frame_Height-4.1875","v":-4.1875},-4.1875,88,null,null,"A840",null,1.75,1.25,{"$f":"BSW_A840","v":-2.8125},null,3.5]
[null,{"$f":"IF(FrameR<MINR,1,0)","v":{"$error":"#DIV/0!"}},null,null,null,null,null,{"$f":"Model_Select","v":"Select Model"},null,null,{"$f":"VLOOKUP(Model_Select,H18:L28,4,FALSE)","v":{"$error":"#N/A"}},{"$f":"VLOOKUP(Model_Select,H18:L28,5,FALSE)","v":{"$error":"#N/A"}},null,null,"A844",null,1.75,1.25,{"$f":"BSW_A840","v":-2.8125},null,3.5]
[null,null,null,null,{"$f":"IF(OR(ModelNo=\"0100\",ModelNo=\"01HP\",ModelNo=\"0102\",ModelNo=\"0103\",ModelNo=\"0104\",ModelNo=\"0109\",ModelNo=\"0151\",ModelNo=\"0152\",ModelNo=\"0153\",ModelNo=\"0154\",ModelNo=\"0155\",ModelNo=\"0170\",ModelNo=\"0171\",ModelNo=\"0172\",ModelNo=\"0173\",ModelNo=\"S174\",ModelNo=\"S175\",ModelNo=\"0179\",ModelNo=\"0301\"),1,0)","v":0},"Screen",null,null,null,null,null,{"$f":"IF(K29>L29,1,0)","v":{"$error":"#N/A"}},null,null,"A846",null,1.75,1.25,{"$f":"BSW_A840","v":-2.8125},null,3.5]
[null,"SHAT_MESSAGE",null,null,1,{"$f":"IF(SCREEN1>\"\",SCREEN1,\"\")","v":""},null,null,null,null,null,{"$f":"IF(L30=1,\"Max Short Glass Must be Less Than \"&MAX_SG,\"\")","v":{"$error":"#N/A"}},null,null,"7SH2",null,1.4375,null,{"$f":"BSW_7SH2","v":-1.78125},null,1.9375]
[null,{"$f":"IF(B29=1,\"R. Must be > Than \"&MINR,\"\")","v":{"$error":"#DIV/0!"}},null,null,2,{"$f":"IF(SCREEN2>\"\",SCREEN2,\"\")","v":""},null,null,null,null,null,null,null,null,"7SH3",null,1.4375,null,{"$f":"BSW_7SH3","v":-1.71875},null,1.9375]
[null,null,null,null,3,{"$f":"IF(SCREEN3>\"\",SCREEN3,\"\")","v":""},null,null,null,null,null,null,null,null,"8SH2",null,1.75,null,{"$f":"BSW_8SH2","v":-2.28125},null,2.25]
[null,"LIMIT1 & LIMIT2",null,null,1,{"$f":"IF(Screen_Type=3,\"L\",IF(Screen_Type=2,\"F\",\"H\"))","v":"H"},null,null,null,null,null,null,null,null,"8SH3",null,1.75,null,{"$f":"BSW_8SH3","v":-2.1875},null,2.25]
[null,{"$f":"IF(OR(TSH>50,BSH>50),\"Sash Hgt Must be < 50\",\"\")","v":""}]
[null,{"$f":"IF(AND(OR(Glass<4,Glass>5),OR(TGSF>15,BGSF>15)),\"GLASS MUST BE < 15 SF\",IF(AND(OR(Glass=4,Glass=5),OR(TGSF>11,BGSF>11)),\"GLASS MUST BE <11 SF\",\"\"))","v":""},null,null,null,"Add Grid for Weight Calc"]
[null,null,null,null,{"$f":"IF(GRIDWEIGHT=TRUE,0.25,0)","v":0},false]
[null,{"$f":"IF(AND(EXTSELECT=1,OR(SELECTEXT=\"Select Reinforcement\",SELECTEXT=\"Select Extrusion\")),\"<< Must Select\",\"\")","v":""}]
[null,{"$f":"IF(AND(EXT_CONTROL=0,W>0,H>0,LEG>0),\"<< Not a Valid Entry\",IF(AND(EXT_CONTROL=1,W>0,H>0,LEG=0),\"<< Need Leg Height\",IF(AND(ModelNo=\"A140\",W>0,H>0,LEG<>(Frame_Height-(Frame_Width/2))),\"<< Leg Should be\"&\" \"&(Frame_Height-(Frame_Width/2)),IF(AND(ModelNo=\"A144\",W>0,H>0,Frame_Width>(Frame_Height-LEG)),\"<< Radius Must be < than Width/2\",\"\"))))","v":""}]
[null,null,null,null,null,{"$f":"IF(AND(OR(ModelNo=\"73HP\",ModelNo=\"73WP\"),EXTSELECT=2),0.3125,IF(AND(OR(ModelNo=\"73HP\",ModelNo=\"73WP\"),EXTSELECT=3),0.4375,IF(AND(OR(ModelNo=\"83HP\",ModelNo=\"83WP\"),EXTSELECT=2),0.4375,IF(AND(OR(ModelNo=\"83HP\",ModelNo=\"83WP\"),EXTSELECT=3),0.5625,0))))","v":0}]

{"sheet":"Data","index":3,"n_rows":425,"n_cols":81,"rows_kept":425,"cut":false,"hidden":true,"merged":[]}
[null,"Model","Description","Value"]
[{"$f":"IF(ModelNo=B2,1,\"\")","v":""},"3A01","Top Sash Width",{"$f":"Frame_Width-4.125","v":-4.125},null,{"$f":"Model_Select","v":"Select Model"},"Models","Description","W cut-back","H-cut-back","Width","Height","Min W","Min H","Max W","Max H","Max UI","Type1","Type2","Type3","Type4","Screen1","Screen2","Screen3","Ext./Reinf.","Ext./Reinf.","Ext./Reinf.","Ext./Reinf.","Ext./Reinf.","Offset","Glass1","Glass2","Glass3","Glass4","Glass5","Glass6","Glass7","Glass8","Opening","CDIM","DDIM","TSW","TSH","TGW","TGH","TGSF","BSW","BSH","BGW","BGH","BGSF","Bott. Sash Weight","Top Sash Weight","Bot. of Coil From CMR","Head + 4.5","Sill + CMR","EW","EH",null,null,null,null,null,null,null,null,null,null,"Triple IG calculation",null,null,null,null,null,null,null,"S140 Limitations"]
[{"$f":"IF(ModelNo=B3,2,\"\")","v":""},"3A01","Top Sash Height",{"$f":"DDIM_3A01-1.625","v":-1.625},null,1,"Select Model"]
[{"$f":"IF(ModelNo=B4,3,\"\")","v":""},"3A01","Bottom Sash Width",{"$f":"Frame_Width-3.125","v":-3.125},null,2,"3A01","Montrose Double Hung",0,0,null,null,12,20,{"$f":"IF(EXTSELECT=2,48,IF(EXTSELECT=3,52,\"\"))","v":""},{"$f":"IF(EXTSELECT=2,84,IF(EXTSELECT=3,96,\"\"))","v":""},{"$f":"IF(EXTSELECT=2,126,IF(EXTSELECT=3,148,\"\"))","v":""},"Standard","Custom",null,{"$f":"IF(AND(W>0,H>0,BTYPE=\"Custom\",CMR=0),\"<< Enter CMR Location\",IF(AND(W>0,H>0,BTYPE=\"Custom\"),\"<< CMR, Bottom-Up\",\"\"))","v":""},"Half","Full","Locking","Select Reinforcement","Composite","Steel",null,null,null,"Single Strength (2.5 mm)","Double Strength (3 mm)","Triple Strength (5 mm)","Triple IG Single Strength","Triple IG Double Strength","Laminated",null,null,{"$f":"IF(RO=2,\"<< Exact Size Only\",\"\")","v":""},{"$f":"Frame_Height-DDIM_3A01","v":0},{"$f":"IF(TYPE=1,(Frame_Height/2),IF(TYPE=2,Frame_Height-CMR))","v":0},{"$f":"TSW_3A01","v":-4.125},{"$f":"TSH_3A01","v":-1.625},{"$f":"TGW_3A01","v":-5.8125},{"$f":"TGH_3A01","v":-3.25},{"$f":"(AR4*AS4)/144","v":0.13118489583333334},{"$f":"BSW_3A01","v":-3.125},{"$f":"BSH_3A01","v":-0.625},{"$f":"BGW_3A01","v":-4.8125},{"$f":"BGH_3A01","v":-2.25},{"$f":"(AW4*AX4)/144","v":7.51953125E-2},{"$f":"BWGT_3A01","v":{"$error":"#VALUE!"}},{"$f":"TWGT_3A01","v":{"$error":"#VALUE!"}},{"$f":"IF(COIL=1,3.875-0.6875,3.875+((COIL-1)*1.625)-0.6875)","v":{"$error":"#N/A"}},6,1.875,{"$f":"Frame_Width-5.25","v":-5.25},{"$f":"IF(AND(AV4>36.0625,(Frame_Height/2)<=CMR),CDIM_3A01-BD4-BB4-0.125,IF(OR(AND(AV4>36.0625,(Frame_Height/2)<=CMR),(Frame_Height/2)>=CMR),Frame_Height-AV4-BC4-BD4,CDIM_3A01-BD4-BB4-0.125))","v":-7.25},null,null,null,null,null,1,"Single Strength (2.5 mm)",null,null,null,"SS (2.2)","DS (3.2)","4 mm","TS (5.0)",null,null,null,null,"Min. W","Min. H","Max. W","Max. H","Max. UI"]
[{"$f":"IF(ModelNo=B5,4,\"\")","v":""},"3A01","Bottom Sash Height",{"$f":"CDIM_3A01-0.625","v":-0.625},null,3,"3A02","Montrose Two Lite Slider",0,0,null,null,18.5,11.25,{"$f":"IF(EXTSELECT=2,72,IF(EXTSELECT=3,96,\"\"))","v":""},{"$f":"IF(EXTSELECT=2,56,IF(EXTSELECT=3,72,\"\"))","v":""},{"$f":"IF(EXTSELECT=2,128,IF(EXTSELECT=3,156,\"\"))","v":""},"Standard",null,null,null,"Half","Full",null,"Select Reinforcement","Composite","Steel",null,null,null,"Single Strength (2.5 mm)","Double Strength (3 mm)","Triple Strength (5 mm)","Triple IG Single Strength","Triple IG Double Strength","Laminated",null,null,"",null,null,null,null,null,null,null,null,null,null,null,null,null,null,null,null,null,{"$f":"(Frame_Width/2)-4.75","v":-4.75},null,null,null,null,null,null,2,"Double Strength (3 mm)",null,null,"Max. Short",{"$f":"IF(TG2W>41,0,41)","v":41},{"$f":"IF(TG2W>56,0,56)","v":56},{"$f":"IF(TG2W>67,0,67)","v":67},{"$f":"IF(TG2W>70,0,70)","v":70},"Annealed",null,null,"Mezzo",25,40]
[{"$f":"IF(ModelNo=B6,5,\"\")","v":""},"3A01","Top Glass Width",{"$f":"TSW_3A01-1.6875","v":-5.8125},null,4,"3A03","Montrose Three Lite Slider (1/4-1/2-1/4)",0,0,null,null,47.5,11.25,{"$f":"IF(EXTSELECT=2,108,IF(EXTSELECT=3,120,\"\"))","v":""},{"$f":"IF(EXTSELECT=2,56,IF(EXTSELECT=3,72,\"\"))","v":""},{"$f":"IF(EXTSELECT=2,164,IF(EXTSELECT=3,192,\"\"))","v":""},"Standard (1/4-1/2-1/4)",null,null,null,"Half","Full",null,"Select Reinforcement","Composite","Steel",null,null,null,"Single Strength (2.5 mm)","Double Strength (3 mm)","Triple Strength (5 mm)","Triple IG Single Strength","Triple IG Double Strength","Laminated",null,null,"",null,null,null,null,null,null,null,null,null,null,null,null,null,null,null,null,null,{"$f":"(Frame_Width/4)-2.25","v":-2.25},null,null,null,null,null,null,3,"Triple Strength (5 mm)",null,null,"Max. Long",{"$f":"IF(TG2H>62,0,62)","v":62},{"$f":"IF(TG2H>76,0,76)","v":76},{"$f":"IF(TG2H>90,0,90)","v":90},{"$f":"IF(TG2H>102,0,102)","v":102},"Annealed",null,null,"Mezzo/N.F",26,41]
[{"$f":"IF(ModelNo=B7,6,\"\")","v":""},"3A01","Top Glass Height",{"$f":"TSH_3A01-1.625","v":-3.25},null,5,"3A04","Montrose Picture Window",0,0,null,null,9.5,9.5,120,120,180,"Standard",null,null,null,null,null,null,null,null,null,null,null,null,"Single Strength (2.5 mm)","Double Strength (3 mm)","Triple Strength (5 mm)","Triple IG Single Strength","Triple IG Double Strength","Laminated",null,null,"",null,null,null,null,null,null,null,null,null,null,null,null,null,null,null,null,null,null,null,null,null,null,null,null,4,"Triple IG Single Strrength",null,null,"Max Sq.Ft.",{"$f":"IF(TG2A>12,0,12)","v":12},{"$f":"IF(TG2A>22,0,22)","v":22},{"$f":"IF(TG2A>32,0,32)","v":32},{"$f":"IF(TG2A>35,0,35)","v":35},"Annealed",null,null,"New Construction",20,36]
[{"$f":"IF(ModelNo=B8,7,\"\")","v":""},"3A01","Bottom Glass Width",{"$f":"BSW_3A01-1.6875","v":-4.8125},null,6,"3A09","Montrose Three Lite Slider Equal Lite",0,0,null,null,37.25,11.25,{"$f":"IF(EXTSELECT=2,108,IF(EXTSELECT=3,130,\"\"))","v":""},{"$f":"IF(EXTSELECT=2,56,IF(EXTSELECT=3,72,\"\"))","v":""},{"$f":"IF(EXTSELECT=2,164,IF(EXTSELECT=3,192,\"\"))","v":""},"Standard (1/3-1/3-1/3)",null,null,null,"Half","Full",null,"Select Reinforcement","Composite","Steel",null,null,null,"Single Strength (2.5 mm)","Double Strength (3 mm)","Triple Strength (5 mm)","Triple IG Single Strength","Triple IG Double Strength","Laminated",null,null,"",null,null,null,null,null,null,null,null,null,null,null,null,null,null,null,null,null,{"$f":"(Frame_Width/3)-4.375","v":-4.375},null,null,null,null,null,null,5,"Triple IG Double Strength",null,null,"Max. Short",0,{"$f":"IF(TG2W>42,0,42)","v":42},{"$f":"IF(TG2W>70,0,70)","v":70},{"$f":"IF(TG2W>70,0,70)","v":70},"Tempered",null,null,"0700 Series",20,36]
[{"$f":"IF(ModelNo=B9,8,\"\")","v":""},"3A01","Bottom Glass Height",{"$f":"BSH_3A01-1.625","v":-2.25},null,7,"03S0","Montrose Single Hung",0,0,null,null,12,22,{"$f":"IF(EXTSELECT=2,48,IF(EXTSELECT=3,52,\"\"))","v":""},{"$f":"IF(EXTSELECT=2,78,IF(EXTSELECT=3,96,\"\"))","v":""},{"$f":"IF(EXTSELECT=2,126,IF(EXTSELECT=3,148,\"\"))","v":""},"Standard","Custom",null,{"$f":"IF(AND(W>0,H>0,BTYPE=\"Custom\",CMR=0),\"<< Enter CMR Location\",IF(AND(W>0,H>0,BTYPE=\"Custom\"),\"<< CMR, Bottom-Up\",\"\"))","v":""},"Half","Full","Locking","Select Reinforcement","Composite","Steel",null,null,null,"Single Strength (2.5 mm)","Double Strength (3 mm)","Triple Strength (5 mm)","Triple IG Single Strength","Triple IG Double Strength","Laminated",null,null,"",{"$f":"Frame_Height-DDIM_03S0","v":0},{"$f":"IF(TYPE=1,(Frame_Height/2),IF(TYPE=2,Frame_Height-CMR))","v":0},null,null,{"$f":"TGW_03S0","v":-4.6875},{"$f":"TGH_03S0","v":-2.59375},{"$f":"(AR9*AS9)/144","v":8.4431966145833329E-2},{"$f":"BSW_03S0","v":-3.125},{"$f":"BSH_03S0","v":-1.125},{"$f":"BGW_03S0","v":-4.8125},{"$f":"BGH_03S0","v":-2.75},{"$f":"(AW9*AX9)/144","v":9.1905381944444448E-2},{"$f":"BWGT_03S0","v":{"$error":"#VALUE!"}},null,{"$f":"IF(COIL=1,3.875-0.6875,3.875+((COIL-1)*1.625)-0.6875)","v":{"$error":"#N/A"}},6,1.875,{"$f":"Frame_Width-5.8125","v":-5.8125},{"$f":"IF(AND(AV9>36.0625,(Frame_Height/2)<=CMR),CDIM_03S0-BD9-BB9-0.125,IF(OR(AND(AV9>36.0625,(Frame_Height/2)<=CMR),(Frame_Height/2)>=CMR),Frame_Height-AV9-BC9-BD9,CDIM_03S0-BD9-BB9-0.125))","v":-6.75},null,null,null,null,null,6,"Laminated",null,null,"Max. Long",0,{"$f":"IF(TG2H>84,0,84)","v":84},{"$f":"IF(TG2H>129,0,129)","v":129},{"$f":"IF(TG2H>129,0,129)","v":129},"Tempered",null,null,"Fusion",23.5,38]
[{"$f":"IF(ModelNo=B10,9,\"\")","v":""},"3A01","Top Sash Stop Length",{"$f":"SASHSTOP3001","v":7},null,8,"03S2","Montrose Two Lite Single Slider",0,0,null,null,18.5,12,{"$f":"IF(EXTSELECT=2,72,IF(EXTSELECT=3,96,\"\"))","v":""},{"$f":"IF(EXTSELECT=2,56,IF(EXTSELECT=3,72,\"\"))","v":""},{"$f":"IF(EXTSELECT=2,128,IF(EXTSELECT=3,156,\"\"))","v":""},"Standard",null,null,null,"Half","Full",null,"Select Reinforcement","Composite","Steel",null,null,null,"Single Strength (2.5 mm)","Double Strength (3 mm)","Triple Strength (5 mm)","Triple IG Single Strength","Triple IG Double Strength","Laminated",null,null,"",null,null,null,null,null,null,null,null,null,null,null,null,null,null,null,null,null,null,null,null,null,null,null,null,7,"HP Package",null,null,"Max Sq.Ft.",0,{"$f":"IF(TG2A>24.5,0,24.5)","v":24.5},{"$f":"IF(TG2A>42,0,42)","v":42},{"$f":"IF(TG2A>42,0,42)","v":42},"Tempered",null,null,1700,24]
[{"$f":"IF(ModelNo=B11,10,\"\")","v":""},"3A01","Screen Width",{"$f":"IF(Screen=\"H\",Frame_Width-4.5,Frame_Width-4.5625)","v":-4.5},null,9,"03S3","Montrose Three Lite Slider (1/4-1/2-1/4)",0,0,null,null,52,12,{"$f":"IF(EXTSELECT=2,108,IF(EXTSELECT=3,130,\"\"))","v":""},{"$f":"IF(EXTSELECT=2,56,IF(EXTSELECT=3,72,\"\"))","v":""},{"$f":"IF(EXTSELECT=2,164,IF(EXTSELECT=3,182,\"\"))","v":""},"Standard (1/4-1/2-1/4)",null,null,null,"Half","Full",null,"Select Reinforcement","Composite","Steel",null,null,null,"Single Strength (2.5 mm)","Double Strength (3 mm)","Triple Strength (5 mm)","Triple IG Single Strength","Triple IG Double Strength","Laminated",null,null,"",null,null,null,null,null,null,null,null,null,null,null,null,null,null,null,null,null,null,null,null,null,null,null,null,8,"Impact Laminated",null,null,null,{"$f":"IF(AND(BQ5>0,BQ6>0,BQ7>0),1,0)","v":1},{"$f":"IF(AND(BR5>0,BR6>0,BR7>0),1,0)","v":1},{"$f":"IF(AND(BS5>0,BS6>0,BS7>0),1,0)","v":1},{"$f":"IF(AND(BT5>0,BT6>0,BT7>0),1,0)","v":1},{"$f":"IF(BQ11>0,\"≥SS Annealed\",IF(BR11>0,\"≥DS Annealed\",IF(BT11>0,\"TS Annealed\",\"\")))","v":"≥SS Annealed"},null,null,1900,24]
[{"$f":"IF(ModelNo=B12,11,\"\")","v":""},"3A01","Screen Height",{"$f":"IF(Screen=\"L\",TRUNC((CDIM_3A01-0.75)*16+0.5)/16,IF(Screen=\"F\",TRUNC((Frame_Height-3.3125)*16+0.5)/16,TRUNC((CDIM_3A01-0.75)*16+0.5)/16))","v":-0.6875},null,10,"03S4","Montrose Picture Window",0,0,null,null,9.5,9.5,120,120,180,"Standard",null,null,null,null,null,null,null,null,null,null,null,null,"Single Strength (2.5 mm)","Double Strength (3 mm)","Triple Strength (5 mm)","Triple IG Single Strength","Triple IG Double Strength","Laminated",null,null,"",null,null,null,null,null,null,null,null,null,null,null,null,null,null,null,null,null,null,null,null,null,null,null,null,null,null,null,null,null,null,{"$f":"IF(AND(BR8>0,BR9>0,BR10>0),1,0)","v":1},{"$f":"IF(AND(BS8>0,BS9>0,BS10>0),1,0)","v":1},{"$f":"IF(AND(BT8>0,BT9>0,BT10>0),1,0)","v":1},{"$f":"IF(BR12>0,\"≥DS Tempered\",IF(BT12>0,\"TS Tempered\",\"\"))","v":"≥DS Tempered"}]
[{"$f":"IF(ModelNo=B13,12,\"\")","v":""},"3A01","Top Sash Weight (Plus 1 lb)",{"$f":"IF(ISERROR(TOP_WGT&\" \"&\"lb\"),\"N/A\",TOP_WGT&\" \"&\"lb\")","v":"0 lb"},null,11,"03S9","Montrose Three Lite Slider Equal Lite",0,0,null,null,52,12,{"$f":"IF(EXTSELECT=2,108,IF(EXTSELECT=3,130,\"\"))","v":""},{"$f":"IF(EXTSELECT=2,56,IF(EXTSELECT=3,72,\"\"))","v":""},{"$f":"IF(EXTSELECT=2,164,IF(EXTSELECT=3,192,\"\"))","v":""},"Standard (1/3-1/3-1/3)",null,null,null,"Half","Full",null,"Select Reinforcement","Composite","Steel",null,null,null,"Single Strength (2.5 mm)","Double Strength (3 mm)","Triple Strength (5 mm)","Triple IG Single Strength","Triple IG Double Strength","Laminated",null,null,"",null,null,null,null,null,null,null,null,null,null,null,null,null,null,null,null,null,null,null,null,null,null,null,null,null,null,null,null,null,"2.5 mm","3.2 mm","4 mm","5 mm"]
[{"$f":"IF(ModelNo=B14,13,\"\")","v":""},"3A01","Top Balance Size (C.F)",{"$f":"IF(ISERROR((VLOOKUP(TOP_WGT,CFB,2,FALSE))),\"N/A\",(VLOOKUP(TOP_WGT,CFB,2,FALSE)))","v":"N/A"},null,12,"A581","80 Series Single Hung",0.5,0.5,null,null,{"$f":"IF(AND(W>0,H>0,Frame_Height>=30),10.5,15)","v":15},{"$f":"IF(AND(W>0,H>0,Frame_Width>=15),24,30)","v":30},54,96,144,"Standard","Custom",null,{"$f":"IF(AND(W>0,H>0,BTYPE=\"Custom\",CMR=0),\"<< Enter CMR Location\",IF(AND(W>0,H>0,BTYPE=\"Custom\"),\"<< CMR, Bottom-Up\",\"\"))","v":""},"Half Only",null,null,null,null,null,null,null,null,"Single Strength (2.5 mm)","Double Strength (3 mm)","Triple Strength (5 mm)","Triple IG Single Strength","Triple IG Double Strength","Laminated",null,null,"<< Select Opening",{"$f":"IF(TYPE=1,TRUNC((Frame_Height/2)*16+0.5)/16,IF(TYPE=2,TRUNC((CMR-0.25)*16+0.5)/16,0))","v":0},{"$f":"Frame_Height-CDIM_A581","v":0},null,null,{"$f":"Frame_Width-2.5625","v":-2.5625},{"$f":"DDIM_A581-2","v":-2},{"$f":"(AR14*AS14)/144","v":3.5590277777777776E-2},{"$f":"Frame_Width-2.8125","v":-2.8125},{"$f":"CDIM_A581-1.5","v":-1.5},{"$f":"BSW_A581-2.5625","v":-5.375},{"$f":"BSH_A581-2.5625","v":-4.0625},{"$f":"(AW14*AX14)/144","v":0.1516384548611111},{"$f":"BWGT_A581","v":{"$error":"#VALUE!"}},null,null,null,1.75,{"$f":"Frame_Width-3.625","v":-3.625},{"$f":"IF(AND(TYPE=2,CMR>=(Frame_Height/2)),Frame_Height-3.75-BD14-BSH_A581,IF(AND(TYPE=2,CMR<(Frame_Height/2)),CMR-1.4375-BD14,Frame_Height/2-BD14-2.25))","v":-4},null,null,null,null,null,null,null,null,null,"Max. Short",{"$f":"IF(TG2H>41,0,41)","v":41},{"$f":"IF(TG2H>56,0,56)","v":56},{"$f":"IF(TG2H>67,0,67)","v":67},{"$f":"IF(TG2H>70,0,70)","v":70},"Annealed"]
[{"$f":"IF(ModelNo=B15,14,\"\")","v":""},"3A01","Bottom Sash Weight",{"$f":"IF(ISERROR(BTM_WGT&\" \"&\"lb\"),\"N/A\",BTM_WGT&\" \"&\"lb\")","v":"0 lb"},null,13,"A580","80 Series Picture Window",0.5,0.5,null,null,10.5,10.5,120,120,180,"Standard",null,null,null,null,null,null,null,null,null,null,null,null,"Single Strength (2.5 mm)","Double Strength (3 mm)","Triple Strength (5 mm)","Triple IG Single Strength","Triple IG Double Strength","Laminated",null,null,"<< Select Opening",null,null,null,null,null,null,null,null,null,null,null,null,null,null,null,null,null,null,null,null,null,null,null,null,null,null,null,null,"Max. Long",{"$f":"IF(TG2W>62,0,62)","v":62},{"$f":"IF(TG2W>76,0,76)","v":76},{"$f":"IF(TG2W>90,0,90)","v":90},{"$f":"IF(TG2W>102,0,102)","v":102},"Annealed"]
[{"$f":"IF(ModelNo=B16,15,\"\")","v":""},"3A01","Bottom Balance Size (C.F)",{"$f":"IF(ISERROR((VLOOKUP(BTM_WGT,CFB,2,FALSE))),\"N/A\",(VLOOKUP(BTM_WGT,CFB,2,FALSE)))","v":"N/A"},null,14,"A280","80 Series Picture Window",0.5,0.5,null,null,10.5,10.5,120,120,180,"Standard",null,null,null,null,null,null,null,null,null,null,null,null,"Single Strength (2.5 mm)","Double Strength (3 mm)","Triple Strength (5 mm)","Triple IG Single Strength","Triple IG Double Strength","Laminated",null,null,"<< Select Opening",null,null,null,null,null,null,null,null,null,null,null,null,null,null,null,null,null,null,null,null,null,null,null,null,null,null,null,null,"Max Sq.Ft.",{"$f":"IF(TG2A>12,0,12)","v":12},{"$f":"IF(TG2A>22,0,22)","v":22},{"$f":"IF(TG2A>32,0,32)","v":32},{"$f":"IF(TG2A>35,0,35)","v":35},"Annealed"]
[{"$f":"IF(ModelNo=B17,16,\"\")","v":""},"3A01","Egress Opening Width",{"$f":"IF(ISERROR(EW),\"N/A\",EW)","v":0},null,15,"A282","80 Series Single Slider",0.5,0.5,null,null,{"$f":"IF(AND(W>0,H>0,Frame_Height>=14.5),20,29.5)","v":29.5},{"$f":"IF(AND(W>0,H>0,Frame_Width>=29.5),10.5,14.5)","v":14.5},96,72,168,"Standard","Custom",null,{"$f":"IF(AND(W>0,H>0,BTYPE=\"Custom\",CMR=0),\"<< Enter CMR Location\",IF(AND(W>0,H>0,BTYPE=\"Custom\"),\"<< CMR, Left to Right\",\"\"))","v":""},"Half","Full",null,null,null,null,null,null,null,"Single Strength (2.5 mm)","Double Strength (3 mm)","Triple Strength (5 mm)","Triple IG Single Strength","Triple IG Double Strength","Laminated",null,null,"<< Select Opening",{"$f":"IF(TYPE=1,TRUNC((Frame_Width/2)*16+0.5)/16,IF(TYPE=2,TRUNC((CMR-0.25)*32+0.5)/32,0))","v":0},{"$f":"Frame_Width-CDIM_A282","v":0},null,null,null,null,null,null,null,null,null,null,null,null,null,null,null,null,null,null,null,null,null,null,null,null,null,null,"Max. Short",0,{"$f":"IF(TG2H>42,0,42)","v":42},{"$f":"IF(TG2H>70,0,70)","v":70},{"$f":"IF(TG2H>70,0,70)","v":70},"Tempered"]
[{"$f":"IF(ModelNo=B18,17,\"\")","v":""},"3A01","Egress Opening Height",{"$f":"IF(ISERROR(EH),\"N/A\",EH)","v":0},null,16,"A283","80 Series Three Lite Slider",0.5,0.5,null,null,40,10.5,120,72,192,"1/4-1/2-1/4","1/3-1/3-1/3","Custom",{"$f":"IF(AND(W>0,H>0,BTYPE=\"Custom\",CMR=0),\"<< Enter CMR Location\",IF(AND(W>0,H>0,BTYPE=\"Custom\"),\"<< CMR, Ends to M.R\",\"\"))","v":""},"Half","Full",null,null,null,null,null,null,null,"Single Strength (2.5 mm)","Double Strength (3 mm)","Triple Strength (5 mm)","Triple IG Single Strength","Triple IG Double Strength","Laminated",null,null,"<< Select Opening",{"$f":"IF(TYPE=1,TRUNC(((W/4)-0.25)*16+0.5)/16,IF(TYPE=2,TRUNC(((W/3)-0.25)*16+0.5)/16,IF(TYPE=3,TRUNC((CMR-0.25)*16+0.5)/16,0)))","v":-0.1875},{"$f":"TRUNC((Frame_Width-(CDIM_A283*2))*16+0.5)/16","v":0.375},null,null,null,null,null,null,null,null,null,null,null,null,null,null,null,null,null,null,null,null,null,null,null,null,null,null,"Max. Long",0,{"$f":"IF(TG2W>84,0,84)","v":84},{"$f":"IF(TG2W>129,0,129)","v":129},{"$f":"IF(TG2W>129,0,129)","v":129},"Tempered"]
[{"$f":"IF(ModelNo=B19,18,\"\")","v":""},"3A01","Egress Opening Area (sq.ft.)",{"$f":"ROUNDUP(((D17*D18)/144),4)","v":0},null,17,"A780","80 Series. Picture Window",0.5,0.5,null,null,10,10,120,120,180,"Standard",null,null,null,null,null,null,null,null,null,null,null,null,"Single Strength (2.5 mm)","Double Strength (3 mm)","Triple Strength (5 mm)","Triple IG Single Strength","Triple IG Double Strength","Laminated",null,null,"<< Select Opening",null,null,null,null,null,null,null,null,null,null,null,null,null,null,null,null,null,null,null,null,null,null,null,null,null,null,null,null,"Max Sq.Ft.",0,{"$f":"IF(TG2A>24.5,0,24.5)","v":24.5},{"$f":"IF(TG2A>42,0,42)","v":42},{"$f":"IF(TG2A>42,0,42)","v":42},"Tempered"]
[{"$f":"IF(ModelNo=B20,1,\"\")","v":""},"03S0","Bottom Sash Width",{"$f":"Frame_Width-3.125","v":-3.125},null,18,"8SH2","80 Series Twin Single Hung",0.5,0.5,null,null,30,24,72,72,144,"Standard","Custom",null,{"$f":"IF(AND(W>0,H>0,BTYPE=\"Custom\",CMR=0),\"<< Enter CMR Location\",IF(AND(W>0,H>0,BTYPE=\"Custom\"),\"<< CMR, Bottom-Up\",\"\"))","v":""},"Half Only",null,null,null,null,null,null,null,null,"Single Strength (2.5 mm)","Double Strength (3 mm)","Triple Strength (5 mm)","Triple IG Single Strength","Triple IG Double Strength","Laminated",null,null,"<< Select Opening",{"$f":"IF(TYPE=1,Frame_Height/2,IF(TYPE=2,CMR-0.25,0))","v":0},{"$f":"Frame_Height-CDIM_8SH2","v":0},null,null,{"$f":"TRUNC((Frame_Width/2-2.125)*32+0.5)/32","v":-2.09375},{"$f":"DDIM_8SH2-2","v":-2},{"$f":"(AR20*AS20)/144","v":2.9079861111111112E-2},{"$f":"TRUNC((Frame_Width/2-2.3125)*32+0.5)/32","v":-2.28125},{"$f":"CDIM_8SH2-1.5","v":-1.5},{"$f":"BSW_8SH2-2.5625","v":-4.84375},{"$f":"BSH_8SH2-2.5","v":-4},{"$f":"(BGW_8SH2*BGH_8SH2)/144","v":0.1345486111111111},{"$f":"BWGT_8SH2","v":{"$error":"#VALUE!"}},null,null,null,1.75,{"$f":"(Frame_Width/2)-3.0625","v":-3.0625},{"$f":"IF(AND(TYPE=2,CMR>=(Frame_Height/2)),Frame_Height-3.75-BD20-BSH_8SH2,IF(AND(TYPE=2,CMR<(Frame_Height/2)),CMR-1.4375-BD20,Frame_Height/2-BD20-2.25))","v":-4},null,null,null,null,null,null,null,null,null,null,{"$f":"IF(AND(BQ14>0,BQ15>0,BQ16>0),1,0)","v":1},{"$f":"IF(AND(BR14>0,BR15>0,BR16>0),1,0)","v":1},{"$f":"IF(AND(BS14>0,BS15>0,BS16>0),1,0)","v":1},{"$f":"IF(AND(BT14>0,BT15>0,BT16>0),1,0)","v":1},{"$f":"IF(BQ20>0,\"≥SS Annealed\",IF(BR20>0,\"≥DS Annealed\",IF(BT20>0,\"TS Annealed\",\"\")))","v":"≥SS Annealed"}]
[{"$f":"IF(ModelNo=B21,2,\"\")","v":""},"03S0","Bottom Sash Height",{"$f":"CDIM_03S0-1.125","v":-1.125},null,19,"8SH3","80 Series Triple Single Hung",0.5,0.5,null,null,45,24,120,96,194,"Standard","Custom",null,{"$f":"IF(AND(W>0,H>0,BTYPE=\"Custom\",CMR=0),\"<< Enter CMR Location\",IF(AND(W>0,H>0,BTYPE=\"Custom\"),\"<< CMR, Bottom-Up\",\"\"))","v":""},"Half Only",null,null,null,null,null,null,null,null,"Single Strength (2.5 mm)","Double Strength (3 mm)","Triple Strength (5 mm)","Triple IG Single Strength","Triple IG Double Strength","Laminated",null,null,"<< Select Opening",{"$f":"IF(TYPE=1,Frame_Height/2,IF(TYPE=2,CMR-0.25,0))","v":0},{"$f":"Frame_Height-CDIM_8SH3","v":0},null,null,{"$f":"TRUNC(((Frame_Width/3)-2.03125)*32+0.5)/32","v":-2},{"$f":"DDIM_8SH3-2","v":-2},{"$f":"(AR21*AS21)/144","v":2.7777777777777776E-2},{"$f":"TRUNC(((Frame_Width/3)-2.779875+0.57)*32+0.5)/32","v":-2.1875},{"$f":"CDIM_8SH3-1.5","v":-1.5},{"$f":"BSW_8SH3-2.5","v":-4.6875},{"$f":"BSH_8SH3-2.5","v":-4},{"$f":"(BGW_8SH3*BGH_8SH3)/144","v":0.13020833333333334},{"$f":"BWGT_8SH3","v":{"$error":"#VALUE!"}},null,null,null,1.75,{"$f":"BSW_8SH3-0.6875","v":-2.875},{"$f":"IF(AND(TYPE=2,CMR>=(Frame_Height/2)),Frame_Height-3.75-BD21-BSH_8SH3,IF(AND(TYPE=2,CMR<(Frame_Height/2)),CMR-1.4375-BD21,Frame_Height/2-BD21-2.25))","v":-4},null,null,null,null,null,null,null,null,null,null,null,{"$f":"IF(AND(BR17>0,BR18>0,BR19>0),1,0)","v":1},{"$f":"IF(AND(BS17>0,BS18>0,BS19>0),1,0)","v":1},{"$f":"IF(AND(BT17>0,BT18>0,BT19>0),1,0)","v":1},{"$f":"IF(BR21>0,\"≥DS Tempered\",IF(BT21>0,\"TS Tempered\",\"\"))","v":"≥DS Tempered"}]
[{"$f":"IF(ModelNo=B22,3,\"\")","v":""},"03S0","Bottom Glass Width",{"$f":"BSW_03S0-1.6875","v":-4.8125},null,20,"82HP","80 Series Twin Stacked P.W",0.5,0.5,null,null,12,24,44,84,120,"Standard","Custom",null,{"$f":"IF(AND(W>0,H>0,BTYPE=\"Custom\",CMR=0),\"<< Enter CMR Location\",IF(AND(W>0,H>0,BTYPE=\"Custom\"),\"<< CMR Bottom-Up\",\"\"))","v":""},null,null,null,"Select Extrusion","Slider Frame (280/580)","P.W Frame (A780)",null,null,{"$f":"IF(EXTSELECT=3,2,2.125)","v":2.125},"Single Strength (2.5 mm)","Double Strength (3 mm)","Triple Strength (5 mm)","Triple IG Single Strength","Triple IG Double Strength","Laminated",null,null,"<< Select Opening",null,null,null,null,null,null,null,null,null,null,null,null,null,null,null,null,null,null,null,null,null,null,null,null,null,null,null,null,{"$f":"IF(AND(OR(BU11=\"≥SS Annealed\",BU11=\"≥DS Annealed\",BU12=\"≥DS Tempered\",BU20=\"≥SS Annealed\",BU20=\"≥DS Annealed\",BU21=\"≥DS Tempered\")),\"TIG\",\"\")","v":"TIG"},{"$f":"IF(AND(ANNEALED1=0,ANNEALED2=0,OR(TEMPERED1>0,TEMPERED2>0)),\"Tempered is Required for TIG\",\"\")","v":""}]
[{"$f":"IF(ModelNo=B23,4,\"\")","v":""},"03S0","Bottom Glass Height",{"$f":"BSH_03S0-1.625","v":-2.75},null,21,"82WP","80 Series Twin Side by Side P.W",0.5,0.5,null,null,24,12,84,44,120,"Standard","Custom",null,{"$f":"IF(AND(W>0,H>0,BTYPE=\"Custom\",CMR=0),\"<< Enter CMR Location\",IF(AND(W>0,H>0,BTYPE=\"Custom\"),\"<< CMR, Left to Right\",\"\"))","v":""},null,null,null,"Select Extrusion","Slider Frame (280/580)","P.W Frame (A780)",null,null,{"$f":"IF(EXTSELECT=3,2,2.125)","v":2.125},"Single Strength (2.5 mm)","Double Strength (3 mm)","Triple Strength (5 mm)","Triple IG Single Strength","Triple IG Double Strength","Laminated",null,null,"<< Select Opening",null,null,null,null,null,null,null,null,null,null,null,null,null,null,null,null,null,null,null,null,null,null,null,null,null,null,null,null,"Model","Width","Height","Area","Balance"]
[{"$f":"IF(ModelNo=B24,5,\"\")","v":""},"03S0","Top Glass Width",{"$f":"TRUNC((Frame_Width-4.75)*16+0.5)/16","v":-4.6875},null,22,"83HP","80 Series Triple Stacked P.W",0.5,0.5,null,null,12,36,84,108,168,"Standard","Custom",null,{"$f":"IF(AND(W>0,H>0,BTYPE=\"Custom\",CMR=0),\"<< Enter CMR Location\",IF(AND(W>0,H>0,BTYPE=\"Custom\"),\"<< CMR Bottom-Up\",\"\"))","v":""},null,null,null,"Select Extrusion","Slider Frame (280/580)","P.W Frame (A780)",null,null,2.5625,"Single Strength (2.5 mm)","Double Strength (3 mm)","Triple Strength (5 mm)","Triple IG Single Strength","Triple IG Double Strength","Laminated",null,null,"<< Select Opening",{"$f":"TRUNC((IF(TYPE=1,Frame_Height/3,IF(TYPE=2,CMR,0))*16+0.5))/16","v":0},null,null,null,null,null,null,null,null,null,null,null,null,null,null,null,null,null,null,null,null,null,null,null,null,null,null,{"$f":"IF(ModelNo=BP24,ModelNo,0)","v":0},"3A01",{"$f":"MAX(BGW_3A01,TGW_3A01)","v":-4.8125},{"$f":"MAX(BGH_3A01,TGH_3A01)","v":-2.25},{"$f":"(BQ24*BR24)/144","v":7.51953125E-2},{"$f":"IF(AND(OR(Glass=4,Glass=5),OR((ISERROR((VLOOKUP(TOP_WGT,CFB,2,FALSE)))),(ISERROR((VLOOKUP(BTM_WGT,CFB,2,FALSE)))))),1,IF(AND(Glass=3,Single_ST=0),1,0))","v":0}]
[{"$f":"IF(ModelNo=B25,6,\"\")","v":""},"03S0","Top Glass Height",{"$f":"TRUNC((DDIM_03S0-2.625)*32+0.5)/32","v":-2.59375},null,23,"83WP","80 Series Triple Side by Side P.W",0.5,0.5,null,null,36,12,108,84,168,"Standard","Custom",null,{"$f":"IF(AND(W>0,H>0,BTYPE=\"Custom\",CMR=0),\"<< Enter CMR Location\",IF(AND(W>0,H>0,BTYPE=\"Custom\"),\"<< CMR, Ends to Mull\",\"\"))","v":""},null,null,null,"Select Extrusion","Slider Frame (280/580)","P.W Frame (A780)",null,null,2.5625,"Single Strength (2.5 mm)","Double Strength (3 mm)","Triple Strength (5 mm)","Triple IG Single Strength","Triple IG Double Strength","Laminated",null,null,"<< Select Opening",{"$f":"TRUNC((IF(TYPE=1,Frame_Width/3,IF(TYPE=2,CMR,0))*16+0.5))/16","v":0},null,null,null,null,null,null,null,null,null,null,null,null,null,null,null,null,null,null,null,null,null,null,null,null,null,null,0,"3A02",{"$f":"GW_3A02","v":-2.5625},{"$f":"GH_3A02","v":-5.4375},{"$f":"(BQ25*BR25)/144","v":9.6761067708333329E-2}]
[{"$f":"IF(ModelNo=B26,7,\"\")","v":""},"03S0","Astragal Length",{"$f":"TRUNC((Frame_Width-4)*16+0.5)/16","v":-3.9375},null,24,"A570","70 Series Picture Window",0.5,0.5,null,null,8.5,8.5,79,79,158,"Standard",null,null,null,null,null,null,null,null,null,null,null,null,"Single Strength (2.5 mm)","Double Strength (3 mm)","Triple Strength (5 mm)","Triple IG Single Strength","Triple IG Double Strength","Laminated",null,null,"<< Select Opening",null,null,null,null,null,null,null,null,null,null,null,null,null,null,null,null,null,null,null,null,null,null,null,null,null,null,null,0,"3A03",{"$f":"MAX(OGW_3A03,FGW_3A03)","v":-1.5},{"$f":"MAX(OGH_3A03,FGH_3A03)","v":-5.4375},5.6640625E-2]
[{"$f":"IF(ModelNo=B27,8,\"\")","v":""},"03S0","Screen Width",{"$f":"Frame_Width-4.5","v":-4.5},null,25,"A571","70 Series Single Hung",0.5,0.5,null,null,{"$f":"IF(AND(W>0,H>0,Frame_Height>=29.5),10,14.5)","v":14.5},{"$f":"IF(AND(W>0,H>0,Frame_Width>=14.5),23.5,29.5)","v":29.5},48,96,144,"Standard","Custom",null,{"$f":"IF(AND(W>0,H>0,BTYPE=\"Custom\",CMR=0),\"<< Enter CMR Location\",IF(AND(W>0,H>0,BTYPE=\"Custom\"),\"<< CMR, Bottom-Up\",\"\"))","v":""},"Half Only",null,null,null,null,null,null,null,null,"Single Strength (2.5 mm)","Double Strength (3 mm)","Triple Strength (5 mm)","Triple IG Single Strength","Triple IG Double Strength","Laminated",null,null,"<< Select Opening",{"$f":"IF(TYPE=1,TRUNC((Frame_Height/2)*16+0.5)/16,IF(TYPE=2,TRUNC((CMR-0.25)*16+0.5)/16,0))","v":0},{"$f":"Frame_Height-CDIM_A571","v":0},null,null,{"$f":"TGW_A571","v":-2.3125},{"$f":"TGH_A571","v":-1.8125},{"$f":"(AR27*AS27)/144","v":2.9106987847222224E-2},{"$f":"BSW_A571","v":-2.125},{"$f":"BSH_A571","v":-0.875},{"$f":"BGW_A571","v":-4.3125},{"$f":"BGH_A571","v":-3.0625},{"$f":"(AW27*AX27)/144","v":9.1715494791666671E-2},{"$f":"BWGT_A571","v":{"$error":"#VALUE!"}},null,null,null,1.4375,{"$f":"Frame_Width-3","v":-3},{"$f":"IF(AND(TYPE=2,CMR>=(Frame_Height/2)),Frame_Height-3.5-BD27-BSH_A571,IF(AND(TYPE=2,CMR<(Frame_Height/2)),CMR-1.4375-BD27,Frame_Height/2-BD27-2.125))","v":-3.5625},null,null,null,null,null,null,null,null,0,"3A04",{"$f":"GW_3A04","v":-4.1875},{"$f":"GH_3A04","v":-4.1875},0.12177191840277778]
[{"$f":"IF(ModelNo=B28,9,\"\")","v":""},"03S0","Screen Height",{"$f":"IF(Screen=\"F\",Frame_Height-3.3125,IF(Screen=\"L\",CDIM_03S0-1.0625,CDIM_03S0-1.3125))","v":-1.3125},null,26,"A270","70 Series Picture Window",0.5,0.5,null,null,8.5,8.5,79,79,158,"Standard",null,null,null,null,null,null,null,null,null,null,null,null,"Single Strength (2.5 mm)","Double Strength (3 mm)","Triple Strength (5 mm)","Triple IG Single Strength","Triple IG Double Strength","Laminated",null,null,"<< Select Opening",null,null,null,null,null,null,null,null,null,null,null,null,null,null,null,null,null,null,null,null,null,null,null,null,null,null,null,0,"3A09",{"$f":"MAX(OGW_3A09,FGW_3A09)","v":-1.875},{"$f":"MAX(OGH_3A09,FGH_3A09)","v":-5.4375},7.080078125E-2]
[{"$f":"IF(ModelNo=B29,10,\"\")","v":""},"03S0","Bottom Sash Weight",{"$f":"IF(ISERROR(BTM_WGT&\" \"&\"lb\"),\"N/A\",BTM_WGT&\" \"&\"lb\")","v":"0 lb"},null,27,"A272","70 Series Single Slider",0.5,0.5,null,null,18,8.5,72,72,144,"Standard","Custom",null,{"$f":"IF(AND(W>0,H>0,BTYPE=\"Custom\",CMR=0),\"<< Enter CMR Location\",IF(AND(W>0,H>0,BTYPE=\"Custom\"),\"<< CMR, Left to Right\",\"\"))","v":""},"Half","Full",null,null,null,null,null,null,null,"Single Strength (2.5 mm)","Double Strength (3 mm)","Triple Strength (5 mm)","Triple IG Single Strength","Triple IG Double Strength","Laminated",null,null,"<< Select Opening",{"$f":"IF(TYPE=1,TRUNC(((Frame_Width/2))*16+0.5)/16,IF(TYPE=2,CMR-0.25))","v":0},{"$f":"Frame_Width-CDIM_A272","v":0},null,null,null,null,null,null,null,null,null,null,null,null,null,null,null,null,null,null,null,null,null,null,null,null,null,0,"03S0",{"$f":"MAX(TGW_03S0,BGW_03S0)","v":-4.6875},{"$f":"MAX(TGH_03S0,BGH_03S0)","v":-2.59375},8.4431966145833329E-2,{"$f":"IF(AND(OR(Glass=4,Glass=5),(ISERROR((VLOOKUP(BTM_WGT,CFB,2,FALSE))))),1,IF(AND(Glass=3,Single_ST=0),1,0))","v":0}]
[{"$f":"IF(ModelNo=B30,11,\"\")","v":""},"03S0","Balance Size",{"$f":"IF(ISERROR((VLOOKUP(BTM_WGT,CFB,2,FALSE))&(VLOOKUP(BTM_WGT,CFB,3,FALSE))),\"N/A\",(VLOOKUP(BTM_WGT,CFB,2,FALSE)))","v":"N/A"},null,28,"A273","70 Series Three Lite Slider",0.5,0.5,null,null,{"$f":"IF(AND(W>0,H>0,Frame_Height>=14.5),47.5,71.5)","v":71.5},{"$f":"IF(AND(W>0,H>0,Frame_Width>=71.5),9.5,14.5)","v":14.5},120,72,192,"1/4-1/2-1/4","1/3-1/3-1/3","Custom",{"$f":"IF(AND(W>0,H>0,BTYPE=\"Custom\",CMR=0),\"<< Enter CMR Location\",IF(AND(W>0,H>0,BTYPE=\"Custom\"),\"<< CMR, Ends to M.R\",\"\"))","v":""},"Half","Full",null,null,null,null,null,null,null,"Single Strength (2.5 mm)","Double Strength (3 mm)","Triple Strength (5 mm)","Triple IG Single Strength","Triple IG Double Strength","Laminated",null,null,"<< Select Opening",{"$f":"IF(TYPE=1,TRUNC(((W/4)-0.25)*16+0.5)/16,IF(TYPE=2,TRUNC(((W/3)-0.25)*16+0.5)/16,IF(TYPE=3,TRUNC((CMR-0.25)*16+0.5)/16,0)))","v":-0.1875},{"$f":"TRUNC((Frame_Width-(CDIM_A273*2))*16+0.5)/16","v":0.375},null,null,null,null,null,null,null,null,null,null,null,null,null,null,null,null,null,null,null,null,null,null,null,null,null,0,"03S2",{"$f":"MAX(SGW_03S2,FGW_03S2)","v":-2.5625},{"$f":"MAX(SGH_03S2,FGH_03S2)","v":-4.6875},8.3414713541666671E-2]
[{"$f":"IF(ModelNo=B31,12,\"\")","v":""},"03S0","Egress Opening Width",{"$f":"IF(ISERROR(EW),\"N/A\",EW)","v":0},null,29,"A770","70 Series Picture Window",0.5,0.5,null,null,8.5,8.5,120,120,180,"Standard",null,null,null,null,null,null,null,null,null,null,null,null,"Single Strength (2.5 mm)","Double Strength (3 mm)","Triple Strength (5 mm)","Triple IG Single Strength","Triple IG Double Strength","Laminated",null,null,"<< Select Opening",null,null,null,null,null,null,null,null,null,null,null,null,null,null,null,null,null,null,null,null,null,null,null,null,null,null,null,0,"03S3",{"$f":"MAX(OGW_03S3,FGW_03S3)","v":-1.5},{"$f":"MAX(OGH_03S3,FGH_03S3)","v":-4.6875},4.8828125E-2]
[{"$f":"IF(ModelNo=B32,13,\"\")","v":""},"03S0","Egress Opening Height",{"$f":"IF(ISERROR(EH),\"N/A\",EH)","v":0},null,30,"7SH2","70 Series Twin Single Hung",0.5,0.5,null,null,30,24,84,72,156,"Standard","Custom",null,{"$f":"IF(AND(W>0,H>0,BTYPE=\"Custom\",CMR=0),\"<< Enter CMR Location\",IF(AND(W>0,H>0,BTYPE=\"Custom\"),\"<< CMR, Bottom-Up\",\"\"))","v":""},"Half Only",null,null,null,null,null,null,null,null,"Single Strength (2.5 mm)","Double Strength (3 mm)","Triple Strength (5 mm)","Triple IG Single Strength","Triple IG Double Strength","Laminated",null,null,"<< Select Opening",{"$f":"IF(TYPE=1,Frame_Height/2,IF(TYPE=2,CMR-0.25,0))","v":0},{"$f":"Frame_Height-CDIM_7SH2","v":0},null,null,{"$f":"TRUNC((Frame_Width/2+0.25-2.25)*32+0.5)/32","v":-1.96875},{"$f":"DDIM_7SH2-1.8125","v":-1.8125},{"$f":"(AR32*AS32)/144","v":2.47802734375E-2},{"$f":"TRUNC((Frame_Width/2+0.25-2.0625)*32+0.5)/32","v":-1.78125},{"$f":"CDIM_7SH2-0.875","v":-0.875},{"$f":"BSW_7SH2-2.1875","v":-3.96875},{"$f":"BSH_7SH2-2.1875","v":-3.0625},{"$f":"(AW32*AX32)/144","v":8.4404839409722224E-2},{"$f":"BWGT_7SH2","v":{"$error":"#VALUE!"}},null,null,null,1.4375,{"$f":"(Frame_Width/2)-3.25","v":-3.25},{"$f":"IF(AND(TYPE=2,CMR>=(Frame_Height/2)),Frame_Height-3.5-BD32-BSH_7SH2,IF(AND(TYPE=2,CMR<(Frame_Height/2)),CMR-1.4375-BD32,Frame_Height/2-BD32-2.125))","v":-3.5625},null,null,null,null,null,null,null,null,0,"03S4",{"$f":"GW_3A04","v":-4.1875},{"$f":"GH_3A04","v":-4.1875},0.12177191840277778]
[{"$f":"IF(ModelNo=B33,14,\"\")","v":""},"03S0","Egress Opening Area (sq.ft.)",{"$f":"ROUNDUP(((D31*D32)/144),4)","v":0},null,31,"7SH3","70 Series Triple Single Hung",0.5,0.5,null,null,45,24,108,84,168,"Standard","Custom",null,{"$f":"IF(AND(W>0,H>0,BTYPE=\"Custom\",CMR=0),\"<< Enter CMR Location\",IF(AND(W>0,H>0,BTYPE=\"Custom\"),\"<< CMR, Bottom-Up\",\"\"))","v":""},"Half Only",null,null,null,null,null,null,null,null,"Single Strength (2.5 mm)","Double Strength (3 mm)","Triple Strength (5 mm)","Triple IG Single Strength","Triple IG Double Strength","Laminated",null,null,"<< Select Opening",{"$f":"IF(TYPE=1,Frame_Height/2,IF(TYPE=2,CMR-0.25,0))","v":0},{"$f":"Frame_Height-CDIM_7SH3","v":0},null,null,{"$f":"TRUNC((((Frame_Width+0.5)-6.25)/3)*32+0.5)/32","v":-1.875},{"$f":"DDIM_7SH3-1.8125","v":-1.8125},{"$f":"(AR33*AS33)/144","v":2.3600260416666668E-2},{"$f":"TRUNC((((Frame_Width+0.5)-5.6875)/3)*32)/32","v":-1.71875},{"$f":"CDIM_7SH3-0.875","v":-0.875},{"$f":"BSW_7SH3-2.1875","v":-3.90625},{"$f":"BSH_7SH3-2.1875","v":-3.0625},{"$f":"(AW33*AX33)/144","v":8.3075629340277776E-2},{"$f":"BWGT_7SH3","v":{"$error":"#VALUE!"}},null,null,null,1.4375,{"$f":"(Frame_Width/3)-3.25","v":-3.25},{"$f":"IF(AND(TYPE=2,CMR>=(Frame_Height/2)),Frame_Height-3.5-BD33-BSH_7SH3,IF(AND(TYPE=2,CMR<(Frame_Height/2)),CMR-1.4375-BD33,Frame_Height/2-BD33-2.125))","v":-3.5625},null,null,null,null,null,null,null,null,0,"03S9",{"$f":"MAX(OGW_03S9,FGW_03S9)","v":-1.875},{"$f":"MAX(OGH_03S9,FGH_03S9)","v":-4.6875},6.103515625E-2]
[{"$f":"IF(ModelNo=B34,1,\"\")","v":""},"3A02","Sash Width",{"$f":"(Frame_Width/2)-0.875","v":-0.875},null,32,"72HP","70 Series Twin Stacked P.W",0.5,0.5,null,null,12,24,72,{"$f":"IF(Frame_Width>44,72,84)","v":84},144,"Standard","Custom",null,{"$f":"IF(AND(W>0,H>0,BTYPE=\"Custom\",CMR=0),\"<< Enter CMR Location\",IF(AND(W>0,H>0,BTYPE=\"Custom\"),\"<< CMR Bottom-Up\",\"\"))","v":""},null,null,null,"Select Extrusion","Slider Frame (270/570)","P.W Frame (A770)",null,null,{"$f":"IF(EXTSELECT=3,1.875,2)","v":2},"Single Strength (2.5 mm)","Double Strength (3 mm)","Triple Strength (5 mm)","Triple IG Single Strength","Triple IG Double Strength","Laminated",null,null,"<< Select Opening",null,null,null,null,null,null,null,null,null,null,null,null,null,null,null,null,null,null,null,null,null,null,null,null,null,null,null,null,"A571",{"$f":"MAX(BGW_A571,TGW_A571)","v":-2.3125},{"$f":"MAX(BGH_A571,TGH_A571)","v":-1.8125},{"$f":"(BQ34*BR34)/144","v":2.9106987847222224E-2}]
[{"$f":"IF(ModelNo=B35,2,\"\")","v":""},"3A02","Sash Height",{"$f":"Frame_Height-3.8125","v":-3.8125},null,33,"72WP","70 Series Twin Side by Side P.W",0.5,0.5,null,null,19,32,{"$f":"IF(Frame_Height>44,72,84)","v":84},96,144,"Standard","Custom",null,{"$f":"IF(AND(W>0,H>0,BTYPE=\"Custom\",CMR=0),\"<< Enter CMR Location\",IF(AND(W>0,H>0,BTYPE=\"Custom\"),\"<< CMR, Left to Right\",\"\"))","v":""},null,null,null,"Select Extrusion","Slider Frame (270/570)","P.W Frame (A770)",null,null,{"$f":"IF(EXTSELECT=3,1.875,2)","v":2},"Single Strength (2.5 mm)","Double Strength (3 mm)","Triple Strength (5 mm)","Triple IG Single Strength","Triple IG Double Strength","Laminated",null,null,"<< Select Opening",null,null,null,null,null,null,null,null,null,null,null,null,null,null,null,null,null,null,null,null,null,null,null,null,null,null,null,0,"A570",{"$f":"GW_A570","v":-2.5625},{"$f":"GH_A570","v":-2.5625},4.5600043402777776E-2]
[{"$f":"IF(ModelNo=B36,3,\"\")","v":""},"3A02","Roller Track Length",{"$f":"Frame_Width-2.5625","v":-2.5625},null,34,"73HP","70 Series Triple Stacked P.W",0.5,0.5,null,null,12,36,84,108,168,"Standard","Custom",null,{"$f":"IF(AND(W>0,H>0,BTYPE=\"Custom\",CMR=0),\"<< Enter CMR Location\",IF(AND(W>0,H>0,BTYPE=\"Custom\"),\"<< CMR Bottom-Up\",\"\"))","v":""},null,null,null,"Select Extrusion","Slider Frame (270/570)","P.W Frame (A770)",null,null,2.3125,"Single Strength (2.5 mm)","Double Strength (3 mm)","Triple Strength (5 mm)","Triple IG Single Strength","Triple IG Double Strength","Laminated",null,null,"<< Select Opening",{"$f":"TRUNC((IF(TYPE=1,Frame_Height/3,IF(TYPE=2,CMR,0))*16+0.5))/16","v":0},null,null,null,null,null,null,null,null,null,null,null,null,null,null,null,null,null,null,null,null,null,null,null,null,null,null,null,"A581",{"$f":"MAX(BGW_A581,TGW_A581)","v":-2.5625},{"$f":"MAX(BGH_A581,TGH_A581)","v":-2},3.5590277777777776E-2]
[{"$f":"IF(ModelNo=B37,4,\"\")","v":""},"3A02","Glass Width",{"$f":"D34-1.6875","v":-2.5625},null,35,"73WP","70 Series Triple Side by Side P.W",0.5,0.5,null,null,36,12,108,84,168,"Standard","Custom",null,{"$f":"IF(AND(W>0,H>0,BTYPE=\"Custom\",CMR=0),\"<< Enter CMR Location\",IF(AND(W>0,H>0,BTYPE=\"Custom\"),\"<< CMR, Ends to Mull\",\"\"))","v":""},null,null,null,"Select Extrusion","Slider Frame (270/570)","P.W Frame (A770)",null,null,2.3125,"Single Strength (2.5 mm)","Double Strength (3 mm)","Triple Strength (5 mm)","Triple IG Single Strength","Triple IG Double Strength","Laminated",null,null,"<< Select Opening",{"$f":"TRUNC((IF(TYPE=1,Frame_Width/3,IF(TYPE=2,CMR,0))*16+0.5))/16","v":0},null,null,null,null,null,null,null,null,null,null,null,null,null,null,null,null,null,null,null,null,null,null,null,null,null,null,0,"A580",{"$f":"GW_A580","v":-2.5625},{"$f":"GH_A580","v":-2.5625},4.5600043402777776E-2]
[{"$f":"IF(ModelNo=B38,5,\"\")","v":""},"3A02","Glass Height",{"$f":"D35-1.625","v":-5.4375},null,36,"A680","Casement Picture Window",0.5,0.5,null,null,11.5,11.5,120,120,180,"Standard",null,null,null,null,null,null,null,null,null,null,null,null,"Single Strength (2.5 mm)","Double Strength (3 mm)","Triple Strength (5 mm)","Triple IG Single Strength","Triple IG Double Strength","Laminated",null,null,"<< Select Opening",null,null,null,null,null,null,null,null,null,null,null,null,null,null,null,null,null,null,null,null,null,null,null,null,null,null,null,0,"A270",{"$f":"GW_A570","v":-2.5625},{"$f":"GH_A570","v":-2.5625},4.5600043402777776E-2]
[{"$f":"IF(ModelNo=B39,6,\"\")","v":""},"3A02","Screen Width",{"$f":"IF(Screen=\"F\",Frame_Width-5,IF(Screen=\"L\",\"N/A\",(Frame_Width/2)-2.4375))","v":-2.4375},null,37,"A681","Single Vent Awning",0.5,0.5,null,null,{"$f":"IF(AND(W>0,H>0,Frame_Height>=18),16,20)","v":20},{"$f":"IF(AND(W>0,H>0,Frame_Width>=20),11.5,18)","v":18},48,48,96,"Standard",null,null,null,"Full",null,null,null,null,null,null,null,null,"Single Strength (2.5 mm)","Double Strength (3 mm)","Triple Strength (5 mm)","Triple IG Single Strength","Triple IG Double Strength","Laminated",null,null,"<< Select Opening",null,null,null,null,null,null,null,null,null,null,null,null,null,null,null,null,null,null,null,null,null,null,null,null,null,null,null,0,"A770",{"$f":"GW_A570","v":-2.5625},{"$f":"GH_A570","v":-2.5625},4.5600043402777776E-2]
[{"$f":"IF(ModelNo=B40,7,\"\")","v":""},"3A02","Screen Height",{"$f":"Frame_Height-4.5625","v":-4.5625},null,38,"A682","Single Vent Casement",0.5,0.5,null,null,15.75,17.5,36,78,114,"Standard",null,null,null,"Full",null,null,null,null,null,null,null,null,"Single Strength (2.5 mm)","Double Strength (3 mm)","Triple Strength (5 mm)","Triple IG Single Strength","Triple IG Double Strength","Laminated",null,null,"<< Select Opening",null,null,null,null,null,null,null,null,null,null,null,null,null,null,null,null,null,{"$f":"Frame_Width-11.4375","v":-11.4375},{"$f":"Frame_Height-5.125","v":-5.125},null,null,null,null,null,null,null,null,0,"A280",{"$f":"GW_A580","v":-2.5625},{"$f":"GH_A580","v":-2.5625},4.5600043402777776E-2]
[{"$f":"IF(ModelNo=B41,8,\"\")","v":""},"3A02","Egress Opening Width",{"$f":"(Frame_Width/2)-4.75","v":-4.75},null,39,"6502","6500 Series Custom 2 Lite Patio Door",0,0,null,null,48,72,96,96,192,"3\" Sash","5\" Sash","French",null,"Half",null,null,null,null,null,null,null,null,"Single Strength (2.5 mm)","Double Strength (3 mm)","Triple Strength (5 mm)","Triple IG Single Strength","Triple IG Double Strength","Laminated",null,null,{"$f":"IF(RO=2,\"<< Exact Size Only\",\"\")","v":""},null,null,null,null,null,null,null,null,null,null,null,null,null,null,null,null,null,null,null,null,null,null,null,null,null,null,null,0,"A780",{"$f":"GW_A580","v":-2.5625},{"$f":"GH_A580","v":-2.5625},4.5600043402777776E-2]
[{"$f":"IF(ModelNo=B42,9,\"\")","v":""},"3A02","Egress Opening Height",{"$f":"Frame_Height-5.25","v":-5.25},null,40,"6503","6500 Series Custom 3 Lite Patio Door",0,0,null,null,84,72,144,96,240,"3\" Sash","5\" Sash","French",null,"Half",null,null,null,null,null,null,null,null,"Single Strength (2.5 mm)","Double Strength (3 mm)","Triple Strength (5 mm)","Triple IG Single Strength","Triple IG Double Strength","Laminated",null,null,{"$f":"IF(RO=2,\"<< Exact Size Only\",\"\")","v":""},null,null,null,null,null,null,null,null,null,null,null,null,null,null,null,null,null,null,null,null,null,null,null,null,null,null,null,0,"A272",{"$f":"MAX(GW_A272,FGW_A272)","v":-1.8125},{"$f":"MAX(GH_A272,FGH_A272)","v":-2.3125},2.9106987847222224E-2]
[{"$f":"IF(ModelNo=B43,10,\"\")","v":""},"3A02","Egress Opening Area (sq.ft.)",{"$f":"ROUNDUP(((D41*D42)/144),4)","v":0.17319999999999999},null,41,"6504","6500 Series Custom 4 Lite Patio Door",0,0,null,null,96,72,144,96,240,"3\" Sash","5\" Sash","French",null,"Half",null,null,null,null,null,null,null,null,"Single Strength (2.5 mm)","Double Strength (3 mm)","Triple Strength (5 mm)","Triple IG Single Strength","Triple IG Double Strength","Laminated",null,null,{"$f":"IF(RO=2,\"<< Exact Size Only\",\"\")","v":""},null,null,null,null,null,null,null,null,null,null,null,null,null,null,null,null,null,null,null,null,null,null,null,null,null,null,null,0,"A273",{"$f":"MAX(OGW_A273,FGW_A273)","v":-1.0625},{"$f":"MAX(OGH_A273,FGH_A273)","v":-2.3125},1.7062717013888888E-2]
[{"$f":"IF(ModelNo=B44,1,\"\")","v":""},"3A03","Operating Sash Width",{"$f":"TRUNC((((Frame_Width/4)+0.1875))*16+0.5)/16","v":0.1875},null,42,"6505","6500 Series Five Foot 2 Lite Patio Door",1.375,0.5,60,80,58.625,79.5,58.625,95.5,156,"3\" Sash","5\" Sash","French",null,"Half",null,null,null,null,null,null,null,null,"Single Strength (2.5 mm)","Double Strength (3 mm)","Triple Strength (5 mm)","Triple IG Single Strength","Triple IG Double Strength","Laminated",null,null,{"$f":"IF(RO=1,\"<< Rough Opening Only\",\"\")","v":"<< Rough Opening Only"},null,null,null,null,null,null,null,null,null,null,null,null,null,null,null,null,null,null,null,null,null,null,null,null,null,null,null,0,"A282",{"$f":"MAX(GW_A282,FGW_A282)","v":-2},{"$f":"MAX(GH_A282,FGH_A282)","v":-2.5625},3.5590277777777776E-2]
[{"$f":"IF(ModelNo=B45,2,\"\")","v":""},"3A03","Operating Sash Height",{"$f":"Frame_Height-3.8125","v":-3.8125},null,43,"6506","6500 Series Six Foot 2 Lite Patio Door",1.375,0.5,72,80,70.625,79.5,70.625,95.5,168,"3\" Sash","5\" Sash","French",null,"Half",null,null,null,null,null,null,null,null,"Single Strength (2.5 mm)","Double Strength (3 mm)","Triple Strength (5 mm)","Triple IG Single Strength","Triple IG Double Strength","Laminated",null,null,"<< Rough Opening Only",null,null,null,null,null,null,null,null,null,null,null,null,null,null,null,null,null,null,null,null,null,null,null,null,null,null,null,0,"A283",{"$f":"MAX(OGW_A283,FGW_A283)","v":-1.125},{"$f":"MAX(OGH_A283,FGH_A283)","v":-2.5625},2.001953125E-2]
[{"$f":"IF(ModelNo=B46,3,\"\")","v":""},"3A03","Fixed Sash Width",{"$f":"(Frame_Width-(2*(TRUNC((((Frame_Width/4)+1))*16+0.5)/16)))+0.75","v":-1.25},null,44,"6508","6500 Series Eight Foot 2 Lite Patio Door",1.75,0.5,96,80,94.25,79.5,94.25,95.5,192,"3\" Sash","5\" Sash","French",null,"Half",null,null,null,null,null,null,null,null,"Single Strength (2.5 mm)","Double Strength (3 mm)","Triple Strength (5 mm)","Triple IG Single Strength","Triple IG Double Strength","Laminated",null,null,"<< Rough Opening Only",null,null,null,null,null,null,null,null,null,null,null,null,null,null,null,null,null,null,null,null,null,null,null,null,null,null,null,0,"A680",{"$f":"MAX(GW1_A680,GW2_A680)","v":-4.125},{"$f":"MAX(GH1_A680,GH2_A680,GH3_A680)","v":-4.125},0.1181640625]
[{"$f":"IF(ModelNo=B47,4,\"\")","v":""},"3A03","Fixed Sash Height",{"$f":"Frame_Height-3.8125","v":-3.8125},null,45,"6509","6500 Series Nine Foot 3 Lite Patio Door",2.5,0.5,108,80,105.5,79.5,105.5,95.5,204,"3\" Sash","5\" Sash","French",null,"Half",null,null,null,null,null,null,null,null,"Single Strength (2.5 mm)","Double Strength (3 mm)","Triple Strength (5 mm)","Triple IG Single Strength","Triple IG Double Strength","Laminated",null,null,"<< Rough Opening Only",null,null,null,null,null,null,null,null,null,null,null,null,null,null,null,null,null,null,null,null,null,null,null,null,null,null,null,0,"A681",{"$f":"GW_A681","v":-5.5625},{"$f":"MAX(GH1_A681,GH2_A681)","v":-5.5625},0.2148708767361111]
[{"$f":"IF(ModelNo=B48,5,\"\")","v":""},"3A03","Roller Track Length",{"$f":"Frame_Width-2.5625","v":-2.5625},null,46,"6512","6500 Series Twelve Foot 4 Lite Patio Door",4.5,0.5,144,80,139.5,79.5,139.5,95.5,240,"3\" Sash","5\" Sash","French",null,"Half",null,null,null,null,null,null,null,null,"Single Strength (2.5 mm)","Double Strength (3 mm)","Triple Strength (5 mm)","Triple IG Single Strength","Triple IG Double Strength","Laminated",null,null,"<< Rough Opening Only",null,null,null,null,null,null,null,null,null,null,null,null,null,null,null,null,null,null,null,null,null,null,null,null,null,null,null,null,"A681",{"$f":"GW_A682","v":-5.5625},{"$f":"MAX(GH1_A682,GH2_A682)","v":-5.5625},{"$f":"(BQ48*BR48)/144","v":0.2148708767361111}]
[{"$f":"IF(ModelNo=B49,6,\"\")","v":""},"3A03","Operating Sash Glass Width",{"$f":"D44-1.6875","v":-1.5},null,47,"6522","6500 Series Twelve Foot 3 Lite Patio Door",3.125,0.5,144,80,140.875,79.5,140.875,95.5,240,"3\" Sash","5\" Sash","French",null,"Half",null,null,null,null,null,null,null,null,"Single Strength (2.5 mm)","Double Strength (3 mm)","Triple Strength (5 mm)","Triple IG Single Strength","Triple IG Double Strength","Laminated",null,null,"<< Rough Opening Only",null,null,null,null,null,null,null,null,null,null,null,null,null,null,null,null,null,null,null,null,null,null,null,null,null,null,null,{"$f":"IF(ModelNo=BP50,ModelNo,0)","v":0},"6502",{"$f":"GW_6502","v":-5.125},{"$f":"GH_6502","v":-8.625},{"$f":"(BQ49*BR49)/144","v":0.30696614583333331}]
[{"$f":"IF(ModelNo=B50,7,\"\")","v":""},"3A03","Operating Sash Glass Height",{"$f":"D45-1.625","v":-5.4375},null,48,"A17A","170 Series Patio Door Sidelite",0.5,0.5,null,null,11.5,47.5,84,96,180,"3\" Sash","5\" Sash","French",null,"Half",null,null,null,null,null,null,null,null,"Single Strength (2.5 mm)","Double Strength (3 mm)","Triple Strength (5 mm)","Triple IG Single Strength","Triple IG Double Strength","Laminated",null,null,"<< Select Opening",null,null,null,null,null,null,null,null,null,null,null,null,null,null,null,null,null,null,null,null,null,null,null,null,null,null,null,0,"6503",{"$f":"GW_6503","v":-5},{"$f":"GH_6503","v":-8.625},0.29947916666666669]
[{"$f":"IF(ModelNo=B51,8,\"\")","v":""},"3A03","Fixed Sash Glass Width",{"$f":"D46-1.6875","v":-2.9375},null,49,"A171","170 Series Patio Door Transom",0.5,0.5,null,null,47.5,11.5,108,49,156,"Standard",null,null,null,null,null,null,null,null,null,null,null,null,"Single Strength (2.5 mm)","Double Strength (3 mm)","Triple Strength (5 mm)","Triple IG Single Strength","Triple IG Double Strength","Laminated",null,null,"<< Select Opening",{"$f":"Frame_Height-AO51","v":0},{"$f":"IF(TYPE=1,(Frame_Height/2),IF(TYPE=2,CMR))","v":0},null,null,null,null,null,null,null,null,null,null,null,null,null,null,null,null,null,null,null,null,null,null,null,null,null,0,"6504",{"$f":"GW_6504","v":-4.6875},{"$f":"GH_6504","v":-8.625},0.28076171875]
[{"$f":"IF(ModelNo=B52,9,\"\")","v":""},"3A03","Fixed Sash Glass Height",{"$f":"D47-1.625","v":-5.4375},null,50,"A172","Two Lite Sliding Patio Door",0.5,0.5,null,null,47.5,47.5,96,96,192,"Standard","Custom",null,null,"Full","Premium",null,null,null,null,null,null,null,"Single Strength (2.5 mm)","Double Strength (3 mm)","Triple Strength (5 mm)","Triple IG Single Strength","Triple IG Double Strength","Laminated",null,null,"<< Select Opening",{"$f":"IF(TYPE=1,TRUNC(((Frame_Width/2))*16+0.5)/16,IF(TYPE=2,CMR))","v":0},{"$f":"Frame_Width-CDIM_A172","v":0},null,null,null,null,null,null,null,null,null,null,null,null,null,null,null,null,null,null,null,null,null,null,null,null,null,0,"6505",{"$f":"GW_6502","v":-5.125},{"$f":"GH_6502","v":-8.625},0.30696614583333331]
[{"$f":"IF(ModelNo=B53,10,\"\")","v":""},"3A03","Screen Width",{"$f":"IF(Screen=\"F\",Frame_Width-5,IF(Screen=\"L\",\"N/A\",TRUNC(((Frame_Width/4)-1.25)*16+0.5)/16))","v":-1.1875},null,51,"A173","Three Lite Sliding Patio Door",0.5,0.5,null,null,71.5,47.5,108,96,204,"Standard","Custom",null,null,"Full","Premium",null,null,null,null,null,null,null,"Single Strength (2.5 mm)","Double Strength (3 mm)","Triple Strength (5 mm)","Triple IG Single Strength","Triple IG Double Strength","Laminated",null,null,"<< Select Opening",{"$f":"IF(TYPE=1,TRUNC(((Frame_Width/3)+0.333)*16+0.5)/16,IF(TYPE=2,CMR+0.1875))","v":0.3125},{"$f":"TRUNC((((Frame_Width-CDIM_A173)/2)-0.25)*16+0.5)/16","v":-0.375},null,null,null,null,null,null,null,null,null,null,null,null,null,null,null,null,null,null,null,null,null,null,null,null,null,0,"6506",{"$f":"GW_6502","v":-5.125},{"$f":"GH_6502","v":-8.625},0.30696614583333331]
[{"$f":"IF(ModelNo=B54,11,\"\")","v":""},"3A03","Screen Height",{"$f":"Frame_Height-4.5625","v":-4.5625},null,52,"A175","Four Lite Sliding Patio Door",0.5,0.5,null,null,95.5,47.5,142,96,238,"Standard","Custom",null,null,"Full","Premium",null,null,null,null,null,null,null,"Single Strength (2.5 mm)","Double Strength (3 mm)","Triple Strength (5 mm)","Triple IG Single Strength","Triple IG Double Strength","Laminated",null,null,"<< Select Opening",{"$f":"IF(TYPE=1,TRUNC(((Frame_Width/4)+0.3595)*16+0.5)/16,IF(TYPE=2,CMR-0.25))","v":0.375},{"$f":"TRUNC(((Frame_Width+0.5)/2-CDIM_A175+0.469)*16+0.5)/16","v":0.375},null,null,null,null,null,null,null,null,null,null,null,null,null,null,null,null,null,null,null,null,null,null,null,null,null,0,"6508",{"$f":"GW_6502","v":-5.125},{"$f":"GH_6502","v":-8.625},0.30696614583333331]
[{"$f":"IF(ModelNo=B55,12,\"\")","v":""},"3A03","Egress Opening Width",{"$f":"(Frame_Width/4)-2.25","v":-2.25},null,53,"A140","Arched Top Single Hung (Round-Top)",0,0,null,null,{"$f":"MINR*2","v":0},42,52,96,148,"Standard","Custom",null,{"$f":"IF(AND(W>0,H>0,BTYPE=\"Custom\",CMR=0),\"<< Enter CMR Location\",IF(AND(W>0,H>0,BTYPE=\"Custom\"),\"<< CMR, Bottom-Up\",\"\"))","v":""},"Half",null,null,"Select Extrusion","Mezzo","Mezzo/N.F","Mezzo w/Stucco",null,2.40625,"Single Strength (2.5 mm)","Double Strength (3 mm)","Triple Strength (5 mm)","Triple IG Single Strength","Triple IG Double Strength","Laminated",null,null,{"$f":"IF(RO=2,\"<< Exact Size Only\",\"\")","v":""},{"$f":"CDIM_A140","v":0},{"$f":"DDIM_A140","v":6},null,null,null,null,null,{"$f":"BSW_SHAT","v":0},{"$f":"BSH_SHAT","v":0},{"$f":"BGW_SHAT","v":0},{"$f":"BGH_SHAT","v":0},{"$f":"(BGW_SHAT*BGH_SHAT)/144","v":0},{"$f":"BWGT_SHAT","v":0},null,{"$f":"IF(COIL=1,3.875-0.6875,3.875+((COIL-1)*1.625)-0.6875)","v":{"$error":"#N/A"}},null,1.875,{"$f":"Frame_Width-5.875","v":-5.875},{"$f":"IF(AV55>(LEG-CDIM_SHAT),LEG-AV55-BD55-0.125,CDIM_SHAT-BD55-0.125)","v":-2},null,null,null,null,null,null,null,null,0,"6509",{"$f":"GW_6503","v":-5},{"$f":"GH_6503","v":-8.625},0.29947916666666669]
[{"$f":"IF(ModelNo=B56,13,\"\")","v":""},"3A03","Egress Opening Height",{"$f":"Frame_Height-5.25","v":-5.25},null,54,"A144","Arched Top Single Hung (Eyebrow)",0,0,null,null,16,43,52,96,148,"Standard","Custom",null,"","Half",null,null,"Select Extrusion","Mezzo","Mezzo/N.F","Mezzo w/Stucco",null,2.40625,"Single Strength (2.5 mm)","Double Strength (3 mm)","Triple Strength (5 mm)","Triple IG Single Strength","Triple IG Double Strength","Laminated",null,null,"",{"$f":"CDIM_A140","v":0},{"$f":"DDIM_A140","v":6},null,null,null,null,null,0,0,0,0,0,0,null,{"$f":"IF(COIL=1,3.875-0.6875,3.875+((COIL-1)*1.625)-0.6875)","v":{"$error":"#N/A"}},null,1.875,{"$f":"Frame_Width-5.875","v":-5.875},-2,null,null,null,null,null,null,null,null,0,"6512",{"$f":"GW_6504","v":-4.6875},{"$f":"GH_6504","v":-8.625},0.28076171875]
[{"$f":"IF(ModelNo=B57,14,\"\")","v":""},"3A03","Egress Opening Area (sq.ft.)",{"$f":"ROUNDUP(((D55*D56)/144),4)","v":8.2100000000000006E-2},null,55,"A146","Arched Top Single Hung (1/2 Eyebrow)",0,0,null,null,16,43,52,96,148,"Standard","Custom",null,"","Half",null,null,"Select Extrusion","Mezzo","Mezzo/N.F","Mezzo w/Stucco",null,2.40625,"Single Strength (2.5 mm)","Double Strength (3 mm)","Triple Strength (5 mm)","Triple IG Single Strength","Triple IG Double Strength","Laminated",null,null,"",{"$f":"CDIM_A140","v":0},{"$f":"DDIM_A140","v":6},null,null,null,null,null,0,0,0,0,0,0,null,{"$f":"IF(COIL=1,3.875-0.6875,3.875+((COIL-1)*1.625)-0.6875)","v":{"$error":"#N/A"}},null,1.875,{"$f":"Frame_Width-5.875","v":-5.875},-2,null,null,null,null,null,null,null,null,null,"6522",{"$f":"GW_6503","v":-5},{"$f":"GH_6503","v":-8.625},0.29947916666666669,{"$f":"IF(AND(OR(Glass=4,Glass=5),OR((ISERROR(TOP_TUBE)),(ISERROR(BTM_TUBE)))),1,IF(AND(Glass=3,Single_ST=0),1,0))","v":0}]
[{"$f":"IF(ModelNo=B58,15,\"\")","v":""},"3A03","Center of Meeting Rail from Edge of Frame",{"$f":"(Frame_Width/4)+1.0625","v":1.0625},null,56,"A840","Arched Top Single Hung (Round-Top)",0.5,0.5,null,null,23.5,36.5,54,96,144,"Standard","Custom",null,"","Half Only",null,null,"Select Extrusion","80s 1-3/8\" NFS","80s 1\" NFS","80s Flush Fin",null,1.28125,"Single Strength (2.5 mm)","Double Strength (3 mm)","Triple Strength (5 mm)","Triple IG Single Strength","Triple IG Double Strength","Laminated",null,null,"<< Select Opening",null,null,null,null,null,null,null,0,0,0,0,0,0,null,null,null,1.75,{"$f":"Frame_Width-3.6255","v":-3.6255000000000002},-1.875,null,null,null,null,null,null,null,null,null,"A17A",{"$f":"GW_A17A","v":-2},{"$f":"GH_A17A","v":-5.75},7.9861111111111105E-2]
[{"$f":"IF(OR(ModelNo=\"3A04\",ModelNo=\"03S4\"),1,\"\")","v":""},"3A04","Glass Width",{"$f":"Frame_Width-4.1875","v":-4.1875},null,57,"A844","Arched Top Single Hung (Eyebrow)",0.5,0.5,null,null,15,30,54,96,144,"Standard","Custom",null,"","Half Only",null,null,"Select Extrusion","80s 1-3/8\" NFS","80s 1\" NFS","80s Flush Fin",null,1.28125,"Single Strength (2.5 mm)","Double Strength (3 mm)","Triple Strength (5 mm)","Triple IG Single Strength","Triple IG Double Strength","Laminated",null,null,"<< Select Opening",null,null,null,null,null,null,null,0,0,0,0,0,0,null,null,null,1.75,{"$f":"Frame_Width-3.6255","v":-3.6255000000000002},-1.875,null,null,null,null,null,null,null,null,{"$f":"IF(ModelNo=BP58,ModelNo,0)","v":0},"A171",{"$f":"GW_A171","v":-2},{"$f":"GH_A171","v":-2},2.7777777777777776E-2]
[{"$f":"IF(OR(ModelNo=\"3A04\",ModelNo=\"03S4\"),2,\"\")","v":""},"3A04","Glass Height",{"$f":"Frame_Height-4.1875","v":-4.1875},null,58,"A846","Arched Top Single Hung (1/2 Eyebrow)",0.5,0.5,null,null,15,30,54,96,144,"Standard","Custom",null,"","Half Only",null,null,"Select Extrusion","80s 1-3/8\" NFS","80s 1\" NFS","80s Flush Fin",null,1.28125,"Single Strength (2.5 mm)","Double Strength (3 mm)","Triple Strength (5 mm)","Triple IG Single Strength","Triple IG Double Strength","Laminated",null,null,"<< Select Opening",null,null,null,null,null,null,null,0,0,0,0,0,0,null,null,null,1.75,{"$f":"Frame_Width-3.6255","v":-3.6255000000000002},-1.875,null,null,null,null,null,null,null,null,0,"A172",{"$f":"MAX(OGW_A172,FGW_A172)","v":-2.5},{"$f":"MAX(OGH_A172,FGH_A172)","v":-5.75},9.9826388888888895E-2]
[{"$f":"IF(OR(ModelNo=\"3A04\",ModelNo=\"03S4\"),3,\"\")","v":""},"3A04","Glass Area (sq.ft.)",{"$f":"(D59*D60)/144","v":0.12177191840277778},null,59,"A740","Arched Top Single Hung (Round-Top)",0.5,0.5,null,null,23.5,37.5,48,96,144,"Standard","Custom",null,"","Half Only",null,null,"Select Extrusion","70s 1-3/8\" NFS","70s 7/8\" NFS","70s J-Channel","70s Flush Fin",1.15625,"Single Strength (2.5 mm)","Double Strength (3 mm)","Triple Strength (5 mm)","Triple IG Single Strength","Triple IG Double Strength","Laminated",null,null,"<< Select Opening",{"$f":"Frame_Height-AO61","v":0},{"$f":"IF(TYPE=1,(Frame_Height/2),IF(TYPE=2,CMR))","v":0},null,null,null,null,null,0,0,0,0,0,0,null,null,null,1.4375,{"$f":"Frame_Width-3","v":-3},-1.5625,null,null,null,null,null,null,null,null,0,"A173",{"$f":"MAX(OGW_A173,FGW_A173)","v":-2.125},{"$f":"MAX(OGH_A173,FGH_A173)","v":-5.75},8.4852430555555552E-2]
[{"$f":"IF(ModelNo=B62,1,\"\")","v":""},"3A09","Operating Sash Width",{"$f":"TRUNC(((Frame_Width/3)-0.3125)*16+0.5)/16","v":-0.25},null,60,"A744","Arched Top Single Hung (Eyebrow)",0.5,0.5,null,null,14.5,29.5,48,96,144,"Standard","Custom",null,"","Half Only",null,null,"Select Extrusion","70s 1-3/8\" NFS","70s 7/8\" NFS","70s J-Channel","70s Flush Fin",1.15625,"Single Strength (2.5 mm)","Double Strength (3 mm)","Triple Strength (5 mm)","Triple IG Single Strength","Triple IG Double Strength","Laminated",null,null,"<< Select Opening",{"$f":"Frame_Height-AO62","v":0},{"$f":"IF(TYPE=1,(Frame_Height/2),IF(TYPE=2,CMR))","v":0},null,null,null,null,null,0,0,0,0,0,0,null,null,null,1.4375,{"$f":"Frame_Width-3","v":-3},-1.5625,null,null,null,null,null,null,null,null,0,"A175",{"$f":"MAX(OGW_A175,FGW_A175)","v":-2.125},{"$f":"MAX(OGH_A175,FGH_A175)","v":-5.75},8.4852430555555552E-2]
[{"$f":"IF(ModelNo=B63,2,\"\")","v":""},"3A09","Operating Sash Height",{"$f":"Frame_Height-3.8125","v":-3.8125},null,61,"A746","Arched Top Single Hung (1/2 Eyebrow)",0.5,0.5,null,null,14.5,29.5,48,96,144,"Standard","Custom",null,"","Half Only",null,null,"Select Extrusion","70s 1-3/8\" NFS","70s 7/8\" NFS","70s J-Channel","70s Flush Fin",1.15625,"Single Strength (2.5 mm)","Double Strength (3 mm)","Triple Strength (5 mm)","Triple IG Single Strength","Triple IG Double Strength","Laminated",null,null,"<< Select Opening",{"$f":"Frame_Height-AO63","v":0},{"$f":"IF(TYPE=1,(Frame_Height/2),IF(TYPE=2,CMR))","v":0},null,null,null,null,null,0,0,0,0,0,0,null,null,null,1.4375,{"$f":"Frame_Width-3","v":-3},-1.5625,null,null,null,null,null,null,null,null,0,{"$f":"ModelNo","v":"Select Model"},{"$f":"IF(ISERROR(VLOOKUP(ModelNo,$BP$24:$BT$62,2,FALSE)),0,VLOOKUP(ModelNo,$BP$24:$BT$62,2,FALSE))","v":0},{"$f":"IF(ISERROR(VLOOKUP(ModelNo,$BP$24:$BT$62,3,FALSE)),0,VLOOKUP(ModelNo,$BP$24:$BT$62,3,FALSE))","v":0},{"$f":"IF(ISERROR(VLOOKUP(ModelNo,$BP$24:$BT$62,4,FALSE)),0,VLOOKUP(ModelNo,$BP$24:$BT$62,4,FALSE))","v":0},{"$f":"IF(ISERROR(VLOOKUP(ModelNo,$BP$24:$BT$62,5,FALSE)),0,VLOOKUP(ModelNo,$BP$24:$BT$62,5,FALSE))","v":0}]
[{"$f":"IF(ModelNo=B64,3,\"\")","v":""},"3A09","Fixed Sash Width",{"$f":"TRUNC(((Frame_Width/3)-0.25)*16+0.5)/16","v":-0.1875},null,null,{"$f":"ModelNo","v":"Select Model"},{"$f":"VLOOKUP(Model_Select,Data,2,FALSE)","v":0},{"$f":"VLOOKUP(Model_Select,Data,3,FALSE)","v":0},{"$f":"VLOOKUP(Model_Select,Data,4,FALSE)","v":0},{"$f":"VLOOKUP(Model_Select,Data,5,FALSE)","v":0},{"$f":"VLOOKUP(Model_Select,Data,6,FALSE)","v":0},{"$f":"VLOOKUP(Model_Select,Data,7,FALSE)","v":0},{"$f":"VLOOKUP(Model_Select,Data,8,FALSE)","v":0},{"$f":"VLOOKUP(Model_Select,Data,9,FALSE)","v":0},{"$f":"VLOOKUP(Model_Select,Data,10,FALSE)","v":0},{"$f":"VLOOKUP(Model_Select,Data,11,FALSE)","v":0},{"$f":"VLOOKUP(Model_Select,Data,12,FALSE)","v":0},{"$f":"VLOOKUP(Model_Select,Data,13,FALSE)","v":0},{"$f":"VLOOKUP(Model_Select,Data,14,FALSE)","v":0},{"$f":"VLOOKUP(Model_Select,Data,15,FALSE)","v":0},{"$f":"VLOOKUP(Model_Select,Data,16,FALSE)","v":0},{"$f":"VLOOKUP(Model_Select,Data,17,FALSE)","v":0},{"$f":"VLOOKUP(Model_Select,Data,18,FALSE)","v":0},{"$f":"VLOOKUP(Model_Select,Data,19,FALSE)","v":0},{"$f":"VLOOKUP(Model_Select,Data,20,FALSE)","v":0},{"$f":"VLOOKUP(Model_Select,Data,21,FALSE)","v":0},{"$f":"VLOOKUP(Model_Select,Data,22,FALSE)","v":0},{"$f":"VLOOKUP(Model_Select,Data,23,FALSE)","v":0},{"$f":"VLOOKUP(Model_Select,Data,24,FALSE)","v":0},{"$f":"VLOOKUP(Model_Select,Data,25,FALSE)","v":0},{"$f":"VLOOKUP(Model_Select,Data,26,FALSE)","v":0},{"$f":"VLOOKUP(Model_Select,Data,27,FALSE)","v":0},{"$f":"VLOOKUP(Model_Select,Data,28,FALSE)","v":0},{"$f":"VLOOKUP(Model_Select,Data,29,FALSE)","v":0},{"$f":"VLOOKUP(Model_Select,Data,30,FALSE)","v":0},{"$f":"VLOOKUP(Model_Select,Data,31,FALSE)","v":0},{"$f":"VLOOKUP(Model_Select,Data,32,FALSE)","v":0},{"$f":"VLOOKUP(Model_Select,Data,33,FALSE)","v":0},{"$f":"VLOOKUP(Model_Select,Data,34,FALSE)","v":0},{"$f":"VLOOKUP(Model_Select,Data,35,FALSE)","v":0},{"$f":"VLOOKUP(Model_Select,Data,36,FALSE)","v":0},{"$f":"VLOOKUP(Model_Select,Data,37,FALSE)","v":0},{"$f":"VLOOKUP(Model_Select,Data,38,FALSE)","v":0},{"$f":"VLOOKUP(Model_Select,Data,39,FALSE)","v":0},{"$f":"VLOOKUP(Model_Select,Data,40,FALSE)","v":0},{"$f":"VLOOKUP(Model_Select,Data,41,FALSE)","v":0},{"$f":"VLOOKUP(Model_Select,Data,42,FALSE)","v":0},{"$f":"VLOOKUP(Model_Select,Data,43,FALSE)","v":0},{"$f":"VLOOKUP(Model_Select,Data,44,FALSE)","v":0},{"$f":"VLOOKUP(Model_Select,Data,45,FALSE)","v":0},{"$f":"VLOOKUP(Model_Select,Data,46,FALSE)","v":0},{"$f":"VLOOKUP(Model_Select,Data,47,FALSE)","v":0},{"$f":"VLOOKUP(Model_Select,Data,48,FALSE)","v":0},{"$f":"VLOOKUP(Model_Select,Data,49,FALSE)","v":0},{"$f":"VLOOKUP(Model_Select,Data,50,FALSE)","v":0},{"$f":"VLOOKUP(Model_Select,Data,51,FALSE)","v":0},{"$f":"VLOOKUP(Model_Select,Data,52,FALSE)","v":0}]
[{"$f":"IF(ModelNo=B65,4,\"\")","v":""},"3A09","Fixed Sash Height",{"$f":"Frame_Height-3.8125","v":-3.8125},null,null,{"$f":"IF(ISERROR(VLOOKUP(Model_Select,$F$188:$G$245,2,FALSE)),\"\",VLOOKUP(Model_Select,$F$188:$G$245,2,FALSE))","v":""},null,null,null,null,{"$f":"IF(OR(ModelNo=\"6405\",ModelNo=\"6406\",ModelNo=\"6408\",ModelNo=\"6409\",ModelNo=\"6412\",ModelNo=\"6422\",ModelNo=\"8405\",ModelNo=\"8406\",ModelNo=\"8408\",ModelNo=\"8409\",ModelNo=\"8412\",ModelNo=\"8422\",ModelNo=\"1106\",ModelNo=\"1109\"),1,0)","v":0},null,null,null,null,null,null,null,null,null,null,null,null,null,null,null,null,null,null,{"$f":"IF(AE64>0,1,0)","v":0},{"$f":"IF(AF64>0,1,0)","v":0},0,0,0,0,0,0,null,null,null,null,null,null,null,null,null,null,null,null,null,null,null,null,null,null,null,null,null,null,null,null,null,null,null,null,0]
[{"$f":"IF(ModelNo=B66,5,\"\")","v":""},"3A09","Roller Track Length",{"$f":"Frame_Width-2.6875","v":-2.6875},null,null,{"$f":"IF(ISERROR(VLOOKUP(Model_Select,$F$40:$G$40,2,FALSE)),\"\",VLOOKUP(Model_Select,$F$40:$G$40,2,FALSE))","v":""},null,null,null,null,{"$f":"IF(HCONTROL=1,96,\"\")","v":""},null,null,null,null,null,null,null,null,null,null,null,null,null,null,null,null,null,null,{"$f":"AE65","v":0},{"$f":"SUM(AE65:AF65)","v":0},{"$f":"SUM(AE65:AG65)","v":0},{"$f":"SUM(AE65:AH65)","v":0},{"$f":"SUM(AE65:AI65)","v":0},{"$f":"SUM(AE65:AJ65)","v":0},{"$f":"SUM(AE65:AK65)","v":0},{"$f":"SUM(AE65:AL65)","v":0},null,null,null,null,null,null,null,null,null,null,null,null,null,null,null,null,null,null,null,null,null,null,null,null,null,null,null,null,0]
[{"$f":"IF(ModelNo=B67,6,\"\")","v":""},"3A09","Operating Sash Glass Width",{"$f":"D62-1.6875","v":-1.9375},null,null,{"$f":"IF(OR(Model_Select=\"A140\",Model_Select=\"A144\",Model_Select=\"A146\",Model_Select=\"A740\",Model_Select=\"A744\",Model_Select=\"A746\",Model_Select=\"A840\",Model_Select=\"A844\",Model_Select=\"A846\"),1,0)","v":0},null,null,null,null,null,null,null,null,null,null,null,null,null,null,null,null,null,null,null,null,null,null,null,{"$f":"AE64","v":0},0,0,0,0,0,0,0,null,null,null,null,null,null,null,null,null,null,null,null,null,null,null,null,null,null,null,null,null,null,null,null,null,null,null,null,0]
[{"$f":"IF(ModelNo=B68,7,\"\")","v":""},"3A09","Operating Sash Glass Height",{"$f":"D63-1.625","v":-5.4375},null,null,null,null,null,null,null,null,null,null,null,null,null,null,null,null,null,null,null,null,null,null,null,null,null,null,{"$f":"IF(ISERROR(HLOOKUP(1,AE66:AL67,2,FALSE)),\"\",HLOOKUP(1,AE66:AL67,2,FALSE))","v":""},{"$f":"IF(ISERROR(HLOOKUP(2,AE66:AL67,2,FALSE)),\"\",HLOOKUP(2,AE66:AL67,2,FALSE))","v":""},{"$f":"IF(ISERROR(HLOOKUP(3,AE66:AL67,2,FALSE)),\"\",HLOOKUP(3,AE66:AL67,2,FALSE))","v":""},{"$f":"IF(ISERROR(HLOOKUP(4,AE66:AL67,2,FALSE)),\"\",HLOOKUP(4,AE66:AL67,2,FALSE))","v":""},{"$f":"IF(ISERROR(HLOOKUP(5,AE66:AL67,2,FALSE)),\"\",HLOOKUP(5,AE66:AL67,2,FALSE))","v":""},{"$f":"IF(ISERROR(HLOOKUP(6,AE66:AL67,2,FALSE)),\"\",HLOOKUP(6,AE66:AL67,2,FALSE))","v":""},{"$f":"IF(ISERROR(HLOOKUP(7,AE66:AL67,2,FALSE)),\"\",HLOOKUP(7,AE66:AL67,2,FALSE))","v":""},{"$f":"IF(ISERROR(HLOOKUP(8,AE66:AL67,2,FALSE)),\"\",HLOOKUP(8,AE66:AL67,2,FALSE))","v":""},null,null,null,null,null,null,null,null,null,null,null,null,null,null,null,null,null,null,null,null,null,null,null,null,null,null,null,null,0]
[{"$f":"IF(ModelNo=B69,8,\"\")","v":""},"3A09","Fixed Sash Glass Width",{"$f":"D64-1.6875","v":-1.875},null,null,null,null,null,null,null,null,null,null,null,null,null,null,null,null,null,null,null,null,null,null,null,null,null,null,"Single Strength (2.5 mm)","S",2.3140000000000001,null,null,null,null,null,null,null,null,null,null,null,null,null,null,null,null,null,null,null,null,null,null,null,null,null,null,null,null,null,null,null,null,null,0]
[{"$f":"IF(ModelNo=B70,9,\"\")","v":""},"3A09","Fixed Sash Glass Height",{"$f":"D65-1.625","v":-5.4375},null,null,null,null,null,null,null,null,null,null,null,null,null,null,null,null,null,null,null,null,null,null,null,null,null,null,"Double Strength (3 mm)","D",3.2,null,null,null,null,null,null,null,null,null,null,null,null,null,null,null,null,null,null,null,null,null,null,null,null,null,null,null,null,null,null,null,null,null,0]
[{"$f":"IF(ModelNo=B71,10,\"\")","v":""},"3A09","Screen Width",{"$f":"IF(Screen=\"F\",Frame_Width-5,IF(Screen=\"L\",\"N/A\",TRUNC((Frame_Width/3+0.625)*16+0.5)/16-2.375))","v":-1.75},null,null,null,null,null,null,null,null,null,null,null,null,null,null,null,null,null,null,null,null,null,null,null,null,null,null,"Triple Strength (5 mm)","T",4.8159999999999998,null,null,null,null,null,null,null,null,null,null,null,null,null,null,null,null,null,null,null,null,null,null,null,null,null,null,null,null,null,null,null,null,null,0]
[{"$f":"IF(ModelNo=B72,11,\"\")","v":""},"3A09","Screen Height",{"$f":"Frame_Height-4.5625","v":-4.5625},null,null,null,null,null,null,null,null,null,null,null,null,null,null,null,null,null,null,null,null,null,null,null,null,null,null,"Triple IG Single Strength","STG",3.4710000000000001,null,null,null,null,null,null,null,null,null,null,null,null,null,null,null,null,null,null,null,null,null,null,null,null,null,null,null,null,null,null,null,null,null,0]
[{"$f":"IF(ModelNo=B73,12,\"\")","v":""},"3A09","Egress Opening Width",{"$f":"(Frame_Width/3)-4.375","v":-4.375},null,null,null,null,null,null,null,null,null,null,null,null,null,null,null,null,null,null,null,null,null,null,null,null,null,null,"Triple IG Double Strength","DTG",4.8,null,null,null,null,null,null,null,null,null,null,null,null,null,null,null,null,null,null,null,null,null,null,null,null,null,null,null,null,null,null,null,null,null,0]
[{"$f":"IF(ModelNo=B74,13,\"\")","v":""},"3A09","Egress Opening Height",{"$f":"Frame_Height-5.25","v":-5.25},null,null,null,null,null,null,null,null,null,null,null,null,null,null,null,null,null,null,null,null,null,null,null,null,null,null,"Laminated","L",5.3659999999999997,null,null,null,null,null,null,null,null,null,null,null,null,null,null,null,null,null,null,null,null,null,null,null,null,null,null,null,null,null,null,null,null,null,0]
[{"$f":"IF(ModelNo=B75,14,\"\")","v":""},"3A09","Egress Opening Area (sq.ft.)",{"$f":"ROUNDUP(((D73*D74)/144),4)","v":0.15959999999999999},null,null,null,null,null,null,null,null,null,null,null,null,null,null,null,null,null,null,null,null,null,null,null,null,null,null,"HP package","H",4.8159999999999998,null,null,null,null,null,null,null,null,null,null,null,null,null,null,null,null,null,null,null,null,null,null,null,null,null,null,null,null,null,null,null,null,null,0]
[{"$f":"IF(ModelNo=B76,15,\"\")","v":""},"3A09","Center of Meeting Rail from Edge of Frame",{"$f":"(TRUNC((Frame_Width/3)*16+0.5)/16)+0.5625","v":0.5625},null,null,null,null,null,null,null,null,null,null,null,null,null,null,null,null,null,null,null,null,null,null,null,null,null,null,"Impact Laminated","IL",5.3659999999999997,null,null,null,null,null,null,null,null,null,null,null,null,null,null,null,null,null,null,null,null,null,null,null,null,null,null,null,null,null,null,null,null,null,0]
[{"$f":"IF(ModelNo=B77,1,\"\")","v":""},"03S2","Sash Width",{"$f":"TRUNC(((Frame_Width/2)-1.0625)*16+0.5)/16","v":-1},null,null,null,null,null,null,null,null,null,null,null,null,null,null,null,null,null,null,null,null,null,null,null,null,null,null,null,null,null,null,null,null,null,null,null,null,null,null,null,null,null,null,null,null,null,null,null,null,null,null,null,null,null,null,null,null,null,null,null,null,null,null,0]
[{"$f":"IF(ModelNo=B78,2,\"\")","v":""},"03S2","Sash Height",{"$f":"Frame_Height-3.0625","v":-3.0625},null,null,null,null,null,null,null,null,null,null,null,null,null,null,null,null,null,null,null,null,null,null,null,null,null,null,null,null,null,null,null,null,null,null,null,null,null,null,null,null,null,null,null,null,null,null,null,null,null,null,null,null,null,null,null,null,null,null,null,null,null,null,0]
[{"$f":"IF(ModelNo=B79,3,\"\")","v":""},"03S2","Roller Track Length",{"$f":"Frame_Width-1.9375","v":-1.9375},null,null,null,null,null,null,null,null,null,null,null,null,null,null,null,null,null,null,null,null,null,null,null,null,null,null,null,null,null,null,null,null,null,null,null,null,null,null,null,null,null,null,null,null,null,null,null,null,null,null,null,null,null,null,null,null,null,null,null,null,null,null,0]
[{"$f":"IF(ModelNo=B80,4,\"\")","v":""},"03S2","Sash Glass Width",{"$f":"TRUNC(((Frame_Width/2)-2.75)*16+0.5)/16","v":-2.6875},null,null,null,null,null,null,null,null,null,null,null,null,null,null,null,null,null,null,null,null,null,null,null,null,null,null,null,null,null,null,null,null,null,null,null,null,null,null,null,null,null,null,null,null,null,null,null,null,null,null,null,null,null,null,null,null,null,null,null,null,null,null,0]
[{"$f":"IF(ModelNo=B81,5,\"\")","v":""},"03S2","Sash Glass Height",{"$f":"Frame_Height-4.6875","v":-4.6875},null,null,null,null,null,null,null,null,null,null,null,null,null,null,null,null,null,null,null,null,null,null,null,null,null,null,null,null,null,null,null,null,null,null,null,null,null,null,null,null,null,null,null,null,null,null,null,null,null,null,null,null,null,null,null,null,null,null,null,null,null,null,0]
[{"$f":"IF(ModelNo=B82,6,\"\")","v":""},"03S2","Fixed Glass Width",{"$f":"TRUNC(((Frame_Width/2)-2.625)*16+0.5)/16","v":-2.5625},null,null,null,null,null,null,null,null,null,null,null,null,null,null,null,null,null,null,null,null,null,null,null,null,null,null,null,null,null,null,null,null,null,null,null,null,null,null,null,null,null,null,null,null,null,null,null,null,null,null,null,null,null,null,null,null,null,null,null,null,null,null,0]
[{"$f":"IF(ModelNo=B83,7,\"\")","v":""},"03S2","Fixed Glass Height",{"$f":"TRUNC((Frame_Height-4.8125)*16+0.5)/16","v":-4.75},null,null,null,null,null,null,null,null,null,null,null,null,null,null,null,null,null,null,null,null,null,null,null,null,null,null,null,null,null,null,null,null,null,null,null,null,null,null,null,null,null,null,null,null,null,null,null,null,null,null,null,null,null,null,null,null,null,null,null,null,null,null,0]
[{"$f":"IF(ModelNo=B84,8,\"\")","v":""},"03S2","Screen Width",{"$f":"IF(Screen=\"F\",Frame_Width-5,IF(Screen=\"L\",\"N/A\",TRUNC(((Frame_Width/2)-3.0625)*16+0.5)/16))","v":-3},null,null,null,null,null,null,null,null,null,null,null,null,null,null,null,null,null,null,null,null,null,null,null,null,null,null,null,null,null,null,null,null,null,null,null,null,null,null,null,null,null,null,null,null,null,null,null,null,null,null,null,null,null,null,null,null,null,null,null,null,null,null,0]
[{"$f":"IF(ModelNo=B85,9,\"\")","v":""},"03S2","Screen Height",{"$f":"Frame_Height-4.5625","v":-4.5625},null,null,null,null,null,null,null,null,null,null,null,null,null,null,null,null,null,null,null,null,null,null,null,null,null,null,null,null,null,null,null,null,null,null,null,null,null,null,null,null,null,null,null,null,null,null,null,null,null,null,null,null,null,null,null,null,null,null,null,null,null,null,0]
[{"$f":"IF(ModelNo=B86,10,\"\")","v":""},"03S2","Egress Opening Width",{"$f":"(Frame_Width/2)-4.75","v":-4.75},null,null,null,null,null,null,null,null,null,null,null,null,null,null,null,null,null,null,null,null,null,null,null,null,null,null,null,null,null,null,null,null,null,null,null,null,null,null,null,null,null,null,null,null,null,null,null,null,null,null,null,null,null,null,null,null,null,null,null,null,null,null,0]
[{"$f":"IF(ModelNo=B87,11,\"\")","v":""},"03S2","Egress Opening Height",{"$f":"Frame_Height-5.875","v":-5.875},null,null,null,null,null,null,null,null,null,null,null,null,null,null,null,null,null,null,null,null,null,null,null,null,null,null,null,null,null,null,null,null,null,null,null,null,null,null,null,null,null,null,null,null,null,null,null,null,null,null,null,null,null,null,null,null,null,null,null,null,null,null,{"$f":"IF(ModelNo=BP85,ModelNo,0)","v":0}]
[{"$f":"IF(ModelNo=B88,12,\"\")","v":""},"03S2","Egress Opening Area (sq.ft.)",{"$f":"ROUNDUP(((D86*D87)/144),4)","v":0.1938}]
[{"$f":"IF(ModelNo=B89,1,\"\")","v":""},"03S3","Operating Sash Width",{"$f":"TRUNC((((Frame_Width/4)+0.1875))*16+0.5)/16","v":0.1875}]
[{"$f":"IF(ModelNo=B90,2,\"\")","v":""},"03S3","Operating Sash Height",{"$f":"Frame_Height-3.0625","v":-3.0625}]
[{"$f":"IF(ModelNo=B91,3,\"\")","v":""},"03S3","Roller Track Length",{"$f":"Frame_Width-1.9375","v":-1.9375}]
[{"$f":"IF(ModelNo=B92,4,\"\")","v":""},"03S3","Operating Sash Glass Width",{"$f":"D89-1.6875","v":-1.5}]
[{"$f":"IF(ModelNo=B93,5,\"\")","v":""},"03S3","Operating Sash Glass Height",{"$f":"Frame_Height-4.6875","v":-4.6875}]
[{"$f":"IF(ModelNo=B94,6,\"\")","v":""},"03S3","Fixed Sash Glass Width",{"$f":"(Frame_Width-2*(TRUNC((Frame_Width/4+0.6875)*16+0.5)/16))-1.625","v":-3}]
[{"$f":"IF(ModelNo=B95,7,\"\")","v":""},"03S3","Fixed Sash Glass Height",{"$f":"Frame_Height-4.8125","v":-4.8125}]
[{"$f":"IF(ModelNo=B96,8,\"\")","v":""},"03S3","Screen Width",{"$f":"IF(Screen=\"F\",Frame_Width-5,IF(Screen=\"L\",\"N/A\",(TRUNC((Frame_Width/4+0.6875)*16+0.5)/16)-2.5))","v":-1.8125}]
[{"$f":"IF(ModelNo=B97,9,\"\")","v":""},"03S3","Screen Height",{"$f":"Frame_Height-4.5625","v":-4.5625}]
[{"$f":"IF(ModelNo=B98,10,\"\")","v":""},"03S3","Egress Opening Width",{"$f":"(Frame_Width/4)-2.875","v":-2.875}]
[{"$f":"IF(ModelNo=B99,11,\"\")","v":""},"03S3","Egress Opening Height",{"$f":"Frame_Height-5.875","v":-5.875}]
[{"$f":"IF(ModelNo=B100,12,\"\")","v":""},"03S3","Egress Opening Area (sq.ft.)",{"$f":"ROUNDUP(((D98*D99)/144),4)","v":0.1173}]
[{"$f":"IF(ModelNo=B101,13,\"\")","v":""},"03S3","Center of Meeting Rail from Edge of Frame",{"$f":"(Frame_Width/4)+1","v":1}]
[{"$f":"IF(ModelNo=B102,1,\"\")","v":""},"03S9","Operating Sash Width",{"$f":"TRUNC(((Frame_Width/3)-0.3125)*16+0.5)/16","v":-0.25}]
[{"$f":"IF(ModelNo=B103,2,\"\")","v":""},"03S9","Operating Sash Height",{"$f":"Frame_Height-3.0625","v":-3.0625}]
[{"$f":"IF(ModelNo=B104,3,\"\")","v":""},"03S9","Roller Track Length",{"$f":"Frame_Width-1.9375","v":-1.9375}]
[{"$f":"IF(ModelNo=B105,4,\"\")","v":""},"03S9","Operating Sash Glass Width",{"$f":"TRUNC(((TRUNC(((Frame_Width/3)-0.3125)*16+0.5)/16)-1.6875)*16+0.5)/16","v":-1.875}]
[{"$f":"IF(ModelNo=B106,5,\"\")","v":""},"03S9","Operating Sash Glass Height",{"$f":"Frame_Height-4.6875","v":-4.6875}]
[{"$f":"IF(ModelNo=B107,6,\"\")","v":""},"03S9","Fixed Sash Glass Width",{"$f":"((Frame_Width-((TRUNC(((Frame_Width/3)+0.1875)*16+0.5)/16)*2))+1.1875)-2.8125","v":-2}]
[{"$f":"IF(ModelNo=B108,7,\"\")","v":""},"03S9","Fixed Sash Glass Height",{"$f":"Frame_Height-4.8125","v":-4.8125}]
[{"$f":"IF(ModelNo=B109,8,\"\")","v":""},"03S9","Screen Width",{"$f":"IF(Screen=\"F\",Frame_Width-5,IF(Screen=\"L\",\"N/A\",(TRUNC((Frame_Width/3+0.1875)*16+0.5)/16)-2.5))","v":-2.3125}]
[{"$f":"IF(ModelNo=B110,9,\"\")","v":""},"03S9","Screen Height",{"$f":"Frame_Height-4.5625","v":-4.5625}]
[{"$f":"IF(ModelNo=B111,10,\"\")","v":""},"03S9","Egress Opening Width",{"$f":"(Frame_Width/3)-4.375","v":-4.375}]
[{"$f":"IF(ModelNo=B112,11,\"\")","v":""},"03S9","Egress Opening Height",{"$f":"Frame_Height-5.875","v":-5.875}]
[{"$f":"IF(ModelNo=B113,12,\"\")","v":""},"03S9","Egress Opening Area (sq.ft.)",{"$f":"ROUNDUP(((D111*D112)/144),4)","v":0.17849999999999999}]
[{"$f":"IF(ModelNo=B114,13,\"\")","v":""},"03S9","Center of Meeting Rail from Edge of Frame",{"$f":"(TRUNC((Frame_Width/3)*16+0.5)/16)+0.5","v":0.5}]
[{"$f":"IF(ModelNo=B115,1,\"\")","v":""},"A571","Bottom Sash Width",{"$f":"Frame_Width-2.125","v":-2.125}]
[{"$f":"IF(ModelNo=B116,2,\"\")","v":""},"A571","Bottom Sash Height",{"$f":"CDIM_A571-0.875","v":-0.875}]
[{"$f":"IF(ModelNo=B117,3,\"\")","v":""},"A571","Bottom Glass Width",{"$f":"D115-2.1875","v":-4.3125}]
[{"$f":"IF(ModelNo=B118,4,\"\")","v":""},"A571","Bottom Glass Height",{"$f":"D116-2.1875","v":-3.0625}]
[{"$f":"IF(ModelNo=B119,5,\"\")","v":""},"A571","Top Glass Width",{"$f":"Frame_Width-2.3125","v":-2.3125}]
[{"$f":"IF(ModelNo=B120,6,\"\")","v":""},"A571","Top Glass Height",{"$f":"DDIM_A571-1.8125","v":-1.8125}]
[{"$f":"IF(ModelNo=B121,7,\"\")","v":""},"A571","Astragal Length",{"$f":"Frame_Width-1.8125","v":-1.8125}]
[{"$f":"IF(ModelNo=B122,8,\"\")","v":""},"A571","Screen Width",{"$f":"Frame_Width-2.125","v":-2.125}]
[{"$f":"IF(ModelNo=B123,9,\"\")","v":""},"A571","Screen Height",{"$f":"CDIM_A571-1.8125","v":-1.8125}]
[{"$f":"IF(ModelNo=B124,10,\"\")","v":""},"A571","Bottom Sash Weight",{"$f":"IF(ISERROR(BTM_WGT&\" \"&\"lb\"),\"N/A\",BTM_WGT&\" \"&\"lb\")","v":"0 lb"}]
[{"$f":"IF(ModelNo=B125,11,\"\")","v":""},"A571","Balance Size (B&T)",{"$f":"IF(ISERROR(BTM_TUBE),\"N/A\",BTM_TUBE)","v":"N/A"}]
[{"$f":"IF(ModelNo=B126,12,\"\")","v":""},"A571","Egress Opening Width",{"$f":"EW","v":0}]
[{"$f":"IF(ModelNo=B127,13,\"\")","v":""},"A571","Egress Opening Height",{"$f":"EH","v":0}]
[{"$f":"IF(ModelNo=B128,14,\"\")","v":""},"A571","Egress Opening Area (sq.ft.)",{"$f":"ROUNDUP(((D126*D127)/144),4)","v":0}]
[{"$f":"IF(OR(ModelNo=\"A570\",ModelNo=\"A270\",ModelNo=\"A770\"),1,0)","v":0},"A570","Glass Width",{"$f":"Frame_Width-2.5625","v":-2.5625}]
[{"$f":"IF(OR(ModelNo=\"A570\",ModelNo=\"A270\",ModelNo=\"A770\"),2,0)","v":0},"A570","Glass Height",{"$f":"Frame_Height-2.5625","v":-2.5625}]
[{"$f":"IF(OR(ModelNo=\"A570\",ModelNo=\"A270\",ModelNo=\"A770\"),3,0)","v":0},"A570","Glass Area (sq.ft.)",{"$f":"(D129*D130)/144","v":4.5600043402777776E-2}]
[{"$f":"IF(ModelNo=B132,1,\"\")","v":""},"A581","Bottom Sash Width",{"$f":"Frame_Width-2.8125","v":-2.8125}]
[{"$f":"IF(ModelNo=B133,2,\"\")","v":""},"A581","Bottom Sash Height",{"$f":"CDIM_A581-1.5","v":-1.5}]
[{"$f":"IF(ModelNo=B134,3,\"\")","v":""},"A581","Bottom Glass Width",{"$f":"BSW_A581-2.5625","v":-5.375}]
[{"$f":"IF(ModelNo=B135,4,\"\")","v":""},"A581","Bottom Glass Height",{"$f":"BSH_A581-2.5625","v":-4.0625}]
[{"$f":"IF(ModelNo=B136,5,\"\")","v":""},"A581","Top Glass Width",{"$f":"Frame_Width-2.5625","v":-2.5625}]
[{"$f":"IF(ModelNo=B137,6,\"\")","v":""},"A581","Top Glass Height",{"$f":"DDIM_A581-2","v":-2}]
[{"$f":"IF(ModelNo=B138,7,\"\")","v":""},"A581","Astragal Length",{"$f":"Frame_Width-2.0625","v":-2.0625}]
[{"$f":"IF(ModelNo=B139,8,\"\")","v":""},"A581","Screen Width",{"$f":"Frame_Width-2.375","v":-2.375}]
[{"$f":"IF(ModelNo=B140,9,\"\")","v":""},"A581","Screen Height",{"$f":"CDIM_A581-2","v":-2}]
[{"$f":"IF(ModelNo=B141,10,\"\")","v":""},"A581","Bottom Sash Weight",{"$f":"IF(ISERROR(BTM_WGT&\" \"&\"lb\"),\"N/A\",BTM_WGT&\" \"&\"lb\")","v":"0 lb"}]
[{"$f":"IF(ModelNo=B142,11,\"\")","v":""},"A581","Balance Size (B&T)",{"$f":"IF(ISERROR(BTM_TUBE),\"N/A\",BTM_TUBE)","v":"N/A"}]
[{"$f":"IF(ModelNo=B143,12,\"\")","v":""},"A581","Egress Opening Width",{"$f":"IF(ISERROR(EW),\"N/A\",EW)","v":0}]
[{"$f":"IF(ModelNo=B144,13,\"\")","v":""},"A581","Egress Opening Height",{"$f":"IF(ISERROR(EH),\"N/A\",EH)","v":0}]
[{"$f":"IF(ModelNo=B145,14,\"\")","v":""},"A581","Egress Opening Area (sq.ft.)",{"$f":"ROUNDUP(((D143*D144)/144),4)","v":0}]
[{"$f":"IF(OR(ModelNo=\"A580\",ModelNo=\"A280\",ModelNo=\"A780\"),1,0)","v":0},"A580","Glass Width",{"$f":"Frame_Width-2.5625","v":-2.5625}]
[{"$f":"IF(OR(ModelNo=\"A580\",ModelNo=\"A280\",ModelNo=\"A780\"),2,0)","v":0},"A580","Glass Height",{"$f":"Frame_Height-2.5625","v":-2.5625}]
[{"$f":"IF(OR(ModelNo=\"A580\",ModelNo=\"A280\",ModelNo=\"A780\"),3,0)","v":0},"A580","Glass Area (sq.ft.)",{"$f":"(D146*D147)/144","v":4.5600043402777776E-2}]
[{"$f":"IF(ModelNo=B149,1,\"\")","v":""},"A272","Sash Width",{"$f":"CDIM_A272-0.875","v":-0.875}]
[{"$f":"IF(ModelNo=B150,2,\"\")","v":""},"A272","Sash Height",{"$f":"Frame_Height-2.125","v":-2.125}]
[{"$f":"IF(ModelNo=B151,3,\"\")","v":""},"A272","Sash Glass Width",{"$f":"D149-2.1875","v":-3.0625}]
[{"$f":"IF(ModelNo=B152,4,\"\")","v":""},"A272","Sash Glass Height",{"$f":"D150-2.1875","v":-4.3125}]
[{"$f":"IF(ModelNo=B153,5,\"\")","v":""},"A272","Fixed Glass Width",{"$f":"DDIM_A272-1.8125","v":-1.8125}]
[{"$f":"IF(ModelNo=B154,6,\"\")","v":""},"A272","Fixed Glass Height",{"$f":"Frame_Height-2.3125","v":-2.3125}]
[{"$f":"IF(ModelNo=B155,7,\"\")","v":""},"A272","Astragal Length",{"$f":"Frame_Height-1.8125","v":-1.8125}]
[{"$f":"IF(ModelNo=B156,8,\"\")","v":""},"A272","Roller Track Length",{"$f":"Frame_Width-1.6875","v":-1.6875}]
[{"$f":"IF(ModelNo=B157,9,\"\")","v":""},"A272","Screen Width",{"$f":"CDIM_A272-1.8125","v":-1.8125}]
[{"$f":"IF(ModelNo=B158,10,\"\")","v":""},"A272","Screen Height",{"$f":"Frame_Height-2.125","v":-2.125}]
[{"$f":"IF(ModelNo=B159,11,\"\")","v":""},"A272","Egress Opening Width",{"$f":"CDIM_A272-2.875","v":-2.875}]
[{"$f":"IF(ModelNo=B160,12,\"\")","v":""},"A272","Egress Opening Height",{"$f":"Frame_Height-3.3125","v":-3.3125}]
[{"$f":"IF(ModelNo=B161,13,\"\")","v":""},"A272","Egress Opening Area (sq.ft.)",{"$f":"ROUNDUP(((D159*D160)/144),4)","v":6.6200000000000009E-2}]
[{"$f":"IF(ModelNo=B162,1,\"\")","v":""},"A273","Operating Sash Width",{"$f":"CDIM_A273-0.875","v":-1.0625}]
[{"$f":"IF(ModelNo=B163,2,\"\")","v":""},"A273","Operating Sash Height",{"$f":"Frame_Height-2.125","v":-2.125}]
[{"$f":"IF(ModelNo=B164,3,\"\")","v":""},"A273","Astragal Length",{"$f":"Frame_Height-1.8125","v":-1.8125}]
[{"$f":"IF(ModelNo=B165,4,\"\")","v":""},"A273","Roller Track Length",{"$f":"Frame_Width-1.6875","v":-1.6875}]
[{"$f":"IF(ModelNo=B166,5,\"\")","v":""},"A273","Operating Sash Glass Width",{"$f":"D162-2.1875","v":-3.25}]
[{"$f":"IF(ModelNo=B167,6,\"\")","v":""},"A273","Operating Sash Glass Height",{"$f":"D163-2.1875","v":-4.3125}]
[{"$f":"IF(ModelNo=B168,7,\"\")","v":""},"A273","Fixed Glass Width",{"$f":"DDIM_A273-1.4375","v":-1.0625}]
[{"$f":"IF(ModelNo=B169,8,\"\")","v":""},"A273","Fixed Glass Height",{"$f":"Frame_Height-2.3125","v":-2.3125}]
[{"$f":"IF(ModelNo=B170,9,\"\")","v":""},"A273","Screen Width",{"$f":"CDIM_A273-1.8125","v":-2}]
[{"$f":"IF(ModelNo=B171,10,\"\")","v":""},"A273","Screen Height",{"$f":"Frame_Height-2.125","v":-2.125}]
[{"$f":"IF(ModelNo=B172,11,\"\")","v":""},"A273","Egress Opening Width",{"$f":"CDIM_A273-2.875","v":-3.0625}]
[{"$f":"IF(ModelNo=B173,12,\"\")","v":""},"A273","Egress Opening Height",{"$f":"Frame_Height-3.3125","v":-3.3125}]
[{"$f":"IF(ModelNo=B174,13,\"\")","v":""},"A273","Egress Opening Area (sq.ft.)",{"$f":"ROUNDUP(((D172*D173)/144),4)","v":7.0500000000000007E-2}]
[{"$f":"IF(ModelNo=B175,1,\"\")","v":""},"A282","Sash Width",{"$f":"CDIM_A282-1.5","v":-1.5}]
[{"$f":"IF(ModelNo=B176,2,\"\")","v":""},"A282","Sash Height",{"$f":"Frame_Height-2.8125","v":-2.8125}]
[{"$f":"IF(ModelNo=B177,3,\"\")","v":""},"A282","Sash Glass Width",{"$f":"D175-2.5625","v":-4.0625}]
[{"$f":"IF(ModelNo=B178,4,\"\")","v":""},"A282","Sash Glass Height",{"$f":"D176-2.5625","v":-5.375}]
[{"$f":"IF(ModelNo=B179,5,\"\")","v":""},"A282","Fixed Glass Width",{"$f":"DDIM_A282-2","v":-2}]
[{"$f":"IF(ModelNo=B180,6,\"\")","v":""},"A282","Fixed Glass Height",{"$f":"Frame_Height-2.5625","v":-2.5625}]
[{"$f":"IF(ModelNo=B181,7,\"\")","v":""},"A282","Astragal Length",{"$f":"Frame_Height-2.0625","v":-2.0625}]
[{"$f":"IF(ModelNo=B182,8,\"\")","v":""},"A282","Roller Track Length",{"$f":"Frame_Width-2.125","v":-2.125}]
[{"$f":"IF(ModelNo=B183,9,\"\")","v":""},"A282","Screen Width",{"$f":"CDIM_A282-2","v":-2}]
[{"$f":"IF(ModelNo=B184,10,\"\")","v":""},"A282","Screen Height",{"$f":"Frame_Height-2.375","v":-2.375}]
[{"$f":"IF(ModelNo=B185,11,\"\")","v":""},"A282","Egress Opening Width",{"$f":"CDIM_A282-3.25","v":-3.25}]
[{"$f":"IF(ModelNo=B186,12,\"\")","v":""},"A282","Egress Opening Height",{"$f":"Frame_Height-3.3125","v":-3.3125}]
[{"$f":"IF(ModelNo=B187,13,\"\")","v":""},"A282","Egress Opening Area (sq.ft.)",{"$f":"ROUNDUP(((D185*D186)/144),4)","v":7.4800000000000005E-2}]
[{"$f":"IF(ModelNo=B188,1,\"\")","v":""},"A283","Operating Sash Width",{"$f":"CDIM_A283-1.5","v":-1.6875}]
[{"$f":"IF(ModelNo=B189,2,\"\")","v":""},"A283","Operating Sash Height",{"$f":"Frame_Height-2.8125","v":-2.8125}]
[{"$f":"IF(ModelNo=B190,3,\"\")","v":""},"A283","Astragal Length",{"$f":"Frame_Height-2.0625","v":-2.0625}]
[{"$f":"IF(ModelNo=B191,4,\"\")","v":""},"A283","Roller Track Length",{"$f":"Frame_Width-2.125","v":-2.125}]
[{"$f":"IF(ModelNo=B192,5,\"\")","v":""},"A283","Operating Sash Glass Width",{"$f":"D188-2.5625","v":-4.25}]
[{"$f":"IF(ModelNo=B193,6,\"\")","v":""},"A283","Operating Sash Glass Height",{"$f":"D189-2.5625","v":-5.375}]
[{"$f":"IF(ModelNo=B194,7,\"\")","v":""},"A283","Fixed Glass Width",{"$f":"DDIM_A283-1.5","v":-1.125}]
[{"$f":"IF(ModelNo=B195,8,\"\")","v":""},"A283","Fixed Glass Height",{"$f":"Frame_Height-2.5625","v":-2.5625}]
[{"$f":"IF(ModelNo=B196,9,\"\")","v":""},"A283","Screen Width",{"$f":"CDIM_A283-1.9375","v":-2.125}]
[{"$f":"IF(ModelNo=B197,10,\"\")","v":""},"A283","Screen Height",{"$f":"Frame_Height-2.375","v":-2.375}]
[{"$f":"IF(ModelNo=B198,11,\"\")","v":""},"A283","Egress Opening Width",{"$f":"CDIM_A283-3.25","v":-3.4375}]
[{"$f":"IF(ModelNo=B199,12,\"\")","v":""},"A283","Egress Opening Height",{"$f":"Frame_Height-3.3125","v":-3.3125}]
[{"$f":"IF(ModelNo=B200,13,\"\")","v":""},"A283","Egress Opening Area (sq.ft.)",{"$f":"ROUNDUP(((D198*D199)/144),4)","v":7.9100000000000004E-2}]
[{"$f":"IF(ModelNo=B201,1,\"\")","v":""},"A680","Fixed Glass Width",{"$f":"Frame_Width-4.125","v":-4.125}]
[{"$f":"IF(ModelNo=B202,2,\"\")","v":""},"A680","Standard Bead Width (BC6410XX)",{"$f":"Frame_Width-1.3125","v":-1.3125}]
[{"$f":"IF(ModelNo=B203,3,\"\")","v":""},"A680","Fixed Glass Height",{"$f":"Frame_Height-4.125","v":-4.125}]
[{"$f":"IF(ModelNo=B204,4,\"\")","v":""},"A680","Standard Bead Height (BC6410XX)",{"$f":"Frame_Height-3.5","v":-3.5}]
[{"$f":"IF(ModelNo=B205,5,\"\")","v":""},"A680","Sash Width for Ventilator or Vent Wrap Option",{"$f":"Frame_Width-1.625","v":-1.625}]
[{"$f":"IF(ModelNo=B206,6,\"\")","v":""},"A680","Sash Height for Ventilator or Vent Wrap Option",{"$f":"Frame_Height-1.625","v":-1.625}]
[{"$f":"IF(ModelNo=B207,7,\"\")","v":""},"A680","Glass Width for Ventilator or Vent Wrap Option",{"$f":"D205-3.9375","v":-5.5625}]
[{"$f":"IF(ModelNo=B208,8,\"\")","v":""},"A680","V.W/Ventilator Bead Width (BC61774XX)",{"$f":"D205-3.625","v":-5.25}]
[{"$f":"IF(ModelNo=B209,9,\"\")","v":""},"A680","V.W Painted Bead Width (BC2105XX)",{"$f":"D205-1.84375","v":-3.46875}]
[{"$f":"IF(ModelNo=B210,10,\"\")","v":""},"A680","V.W Painted Bead TG2 Width (BC2106XX)",{"$f":"D205-1.84375","v":-3.46875}]
[{"$f":"IF(ModelNo=B211,11,\"\")","v":""},"A680","Glass Height for Ventilator or Vent Wrap Option",{"$f":"D206-5.8125","v":-7.4375}]
[{"$f":"IF(ModelNo=B212,12,\"\")","v":""},"A680","V.W/Ventilator Bead Height (BC61774XX)",{"$f":"D206-5.5","v":-7.125}]
[{"$f":"IF(ModelNo=B213,13,\"\")","v":""},"A680","V.W Painted Bead Height (BC2105XX)",{"$f":"D206-4.84375","v":-6.46875}]
[{"$f":"IF(ModelNo=B214,14,\"\")","v":""},"A680","V.W Painted Bead TG2 Height (BC2106XX)",{"$f":"D206-4.84375","v":-6.46875}]
[{"$f":"IF(ModelNo=B215,15,\"\")","v":""},"A680","Glass Height for Vent Wrap Only",{"$f":"D206-3.9375","v":-5.5625}]
[{"$f":"IF(ModelNo=B216,1,\"\")","v":""},"A681","Sash Width",{"$f":"Frame_Width-1.625","v":-1.625}]
[{"$f":"IF(ModelNo=B217,2,\"\")","v":""},"A681","Sash Height",{"$f":"Frame_Height-1.625","v":-1.625}]
[{"$f":"IF(ModelNo=B218,3,\"\")","v":""},"A681","Glass Width",{"$f":"D216-3.9375","v":-5.5625}]
[{"$f":"IF(ModelNo=B219,4,\"\")","v":""},"A681","Glass Height",{"$f":"D217-3.9375","v":-5.5625}]
[{"$f":"IF(ModelNo=B220,5,\"\")","v":""},"A681","Glass Height for Ventilator Option",{"$f":"D217-5.8125","v":-7.4375}]
[{"$f":"IF(ModelNo=B221,6,\"\")","v":""},"A681","Screen Width",{"$f":"Frame_Width-4.9375","v":-4.9375}]
[{"$f":"IF(ModelNo=B222,7,\"\")","v":""},"A681","Screen Height",{"$f":"Frame_Height-4.9375","v":-4.9375}]
[{"$f":"IF(ModelNo=B223,8,\"\")","v":""},"A681","Awning does not meet Egress"]
[{"$f":"IF(ModelNo=B224,1,\"\")","v":""},"A682","Sash Width",{"$f":"Frame_Width-1.625","v":-1.625}]
[{"$f":"IF(ModelNo=B225,2,\"\")","v":""},"A682","Sash Height",{"$f":"Frame_Height-1.625","v":-1.625}]
[{"$f":"IF(ModelNo=B226,3,\"\")","v":""},"A682","Glass Width",{"$f":"D224-3.9375","v":-5.5625}]
[{"$f":"IF(ModelNo=B227,4,\"\")","v":""},"A682","Glass Height",{"$f":"D225-3.9375","v":-5.5625}]
[{"$f":"IF(ModelNo=B228,5,\"\")","v":""},"A682","Glass Height for Ventilator Option",{"$f":"D225-5.8125","v":-7.4375}]
[{"$f":"IF(ModelNo=B229,6,\"\")","v":""},"A682","Screen Width",{"$f":"Frame_Width-4.9375","v":-4.9375}]
[{"$f":"IF(ModelNo=B230,7,\"\")","v":""},"A682","Screen Height",{"$f":"Frame_Height-4.9375","v":-4.9375}]
[{"$f":"IF(ModelNo=B231,8,\"\")","v":""},"A682","Egress Opening Width (Standard Hinge)",{"$f":"Frame_Width-11.4375","v":-11.4375}]
[{"$f":"IF(ModelNo=B232,9,\"\")","v":""},"A682","Egress Opening Height (Standard Hinge)",{"$f":"Frame_Height-5.125","v":-5.125}]
[{"$f":"IF(ModelNo=B233,10,\"\")","v":""},"A682","Egress Opening Area w/Standard Hinge (sq.ft.)",{"$f":"ROUNDUP(((D231*D232)/144),4)","v":0.40709999999999996}]
[{"$f":"IF(ModelNo=B234,11,\"\")","v":""},"A682",{"$f":"IF(OR(Frame_Width<25.75,Frame_Width>31.75),\"Egress Hardware Not Available For This Width\",\"Egress Opening Width (Egress Hinge)\")","v":"Egress Hardware Not Available For This Width"},{"$f":"IF(OR(Frame_Width<25.75,Frame_Width>31.75),\"N/A\",Frame_Width-7.125)","v":"N/A"}]
[{"$f":"IF(ModelNo=B235,12,\"\")","v":""},"A682",{"$f":"IF(OR(Frame_Width<25.75,Frame_Width>31.75),\"Egress Hardware Not Available For This Width\",\"Egress Opening Height (Egress Hinge)\")","v":"Egress Hardware Not Available For This Width"},{"$f":"IF(OR(Frame_Width<25.75,Frame_Width>31.75),\"N/A\",Frame_Height-5.125)","v":"N/A"}]
[{"$f":"IF(ModelNo=B236,13,\"\")","v":""},"A682",{"$f":"IF(OR(Frame_Width<25.75,Frame_Width>31.75),\"Egress Hardware Not Available For This Width\",\"Egress Opening Area w/Egress Hinge (sq.ft.)\")","v":"Egress Hardware Not Available For This Width"},{"$f":"IF(OR(Frame_Width<25.75,Frame_Width>31.75),\"N/A\",ROUNDUP(((D234*D235)/144),4))","v":"N/A"}]
[{"$f":"IF(ModelNo=B237,1,\"\")","v":""},"A17A","Glass Width",{"$f":"Frame_Width-2","v":-2}]
[{"$f":"IF(ModelNo=B238,2,\"\")","v":""},"A17A","Glass Height",{"$f":"Frame_Height-5.75","v":-5.75}]
[{"$f":"IF(ModelNo=B239,3,\"\")","v":""},"A17A","Glass Area (sq.ft.)",{"$f":"(D237*D238)/144","v":7.9861111111111105E-2}]
[{"$f":"IF(ModelNo=B240,1,\"\")","v":""},"A17A","Glass Width",{"$f":"Frame_Width-2","v":-2}]
[{"$f":"IF(ModelNo=B241,2,\"\")","v":""},"A17A","Glass Height",{"$f":"Frame_Height-2","v":-2}]
[{"$f":"IF(ModelNo=B242,3,\"\")","v":""},"A17A","Glass Area (sq.ft.)",{"$f":"(D240*D241)/144","v":2.7777777777777776E-2}]
[{"$f":"IF(ModelNo=B243,1,\"\")","v":""},"A172","Sash Width",{"$f":"CDIM_A172+1.0625","v":1.0625}]
[{"$f":"IF(ModelNo=B244,2,\"\")","v":""},"A172","Sash Height",{"$f":"Frame_Height-2.25","v":-2.25}]
[{"$f":"IF(ModelNo=B245,3,\"\")","v":""},"A172","Sash Glass Width",{"$f":"D243-3.5625","v":-2.5}]
[{"$f":"IF(ModelNo=B246,4,\"\")","v":""},"A172","Sash Glass Height",{"$f":"D244-3.5","v":-5.75}]
[{"$f":"IF(ModelNo=B247,5,\"\")","v":""},"A172","Fixed Glass Width",{"$f":"DDIM_A172-2.5","v":-2.5}]
[{"$f":"IF(ModelNo=B248,6,\"\")","v":""},"A172","Fixed Glass Height",{"$f":"Frame_Height-5.75","v":-5.75}]
[{"$f":"IF(ModelNo=B249,7,\"\")","v":""},"A172","Panel Track",{"$f":"Frame_Width-1.5","v":-1.5}]
[{"$f":"IF(ModelNo=B250,8,\"\")","v":""},"A172","Screen Track",{"$f":"Frame_Width-1.5","v":-1.5}]
[{"$f":"IF(ModelNo=B251,9,\"\")","v":""},"A172","Screen Width",{"$f":"CDIM_A172+0.25","v":0.25}]
[{"$f":"IF(ModelNo=B252,10,\"\")","v":""},"A172","Screen Height",{"$f":"IF(Screen_Type=2,Frame_Height-1.5,Frame_Height-1.75)","v":-1.75}]
[{"$f":"IF(ModelNo=B253,11,\"\")","v":""},"A172","Egress Opening Width",{"$f":"Frame_Width-CDIM_A172-4","v":-4}]
[{"$f":"IF(ModelNo=B254,12,\"\")","v":""},"A172","Egress Opening Height",{"$f":"Frame_Height-3","v":-3}]
[{"$f":"IF(ModelNo=B255,13,\"\")","v":""},"A172","Egress Opening Area (sq.ft.)",{"$f":"ROUNDUP(((D253*D254)/144),4)","v":8.3400000000000002E-2}]
[{"$f":"IF(ModelNo=B256,1,\"\")","v":""},"A173","Sash Width",{"$f":"CDIM_A173+1.0625","v":1.375}]
[{"$f":"IF(ModelNo=B257,2,\"\")","v":""},"A173","Sash Height",{"$f":"Frame_Height-2.25","v":-2.25}]
[{"$f":"IF(ModelNo=B258,3,\"\")","v":""},"A173","Sash Glass Width",{"$f":"D256-3.5625","v":-2.1875}]
[{"$f":"IF(ModelNo=B259,4,\"\")","v":""},"A173","Sash Glass Height",{"$f":"D257-3.5","v":-5.75}]
[{"$f":"IF(ModelNo=B260,5,\"\")","v":""},"A173","Fixed Glass Width",{"$f":"DDIM_A173-1.75","v":-2.125}]
[{"$f":"IF(ModelNo=B261,6,\"\")","v":""},"A173","Fixed Glass Height",{"$f":"Frame_Height-5.75","v":-5.75}]
[{"$f":"IF(ModelNo=B262,7,\"\")","v":""},"A173","Panel Track",{"$f":"Frame_Width-1.5","v":-1.5}]
[{"$f":"IF(ModelNo=B263,8,\"\")","v":""},"A173","Screen Track",{"$f":"Frame_Width-1.5","v":-1.5}]
[{"$f":"IF(ModelNo=B264,9,\"\")","v":""},"A173","Screen Width",{"$f":"CDIM_A173+0.25","v":0.5625}]
[{"$f":"IF(ModelNo=B265,10,\"\")","v":""},"A173","Screen Height",{"$f":"IF(Screen_Type=2,Frame_Height-1.5,Frame_Height-1.75)","v":-1.75}]
[{"$f":"IF(ModelNo=B266,11,\"\")","v":""},"A173","Egress Opening Width",{"$f":"Frame_Width-CDIM_A173-D256-1.75","v":-3.4375}]
[{"$f":"IF(ModelNo=B267,12,\"\")","v":""},"A173","Egress Opening Height",{"$f":"Frame_Height-3","v":-3}]
[{"$f":"IF(ModelNo=B268,13,\"\")","v":""},"A173","Egress Opening Area (sq.ft.)",{"$f":"ROUNDUP(((D266*D267)/144),4)","v":7.17E-2}]
[{"$f":"IF(ModelNo=B269,1,\"\")","v":""},"A175","Sash Width",{"$f":"CDIM_A175+1.0625","v":1.4375}]
[{"$f":"IF(ModelNo=B270,2,\"\")","v":""},"A175","Sash Height",{"$f":"Frame_Height-2.25","v":-2.25}]
[{"$f":"IF(ModelNo=B271,3,\"\")","v":""},"A175","Sash Glass Width",{"$f":"D269-3.5625","v":-2.125}]
[{"$f":"IF(ModelNo=B272,4,\"\")","v":""},"A175","Sash Glass Height",{"$f":"D270-3.5","v":-5.75}]
[{"$f":"IF(ModelNo=B273,5,\"\")","v":""},"A175","Fixed Glass Width",{"$f":"DDIM_A175-2.5","v":-2.125}]
[{"$f":"IF(ModelNo=B274,6,\"\")","v":""},"A175","Fixed Glass Height",{"$f":"Frame_Height-5.75","v":-5.75}]
[{"$f":"IF(ModelNo=B275,7,\"\")","v":""},"A175","Panel Track",{"$f":"Frame_Width-1.5","v":-1.5}]
[{"$f":"IF(ModelNo=B276,8,\"\")","v":""},"A175","Screen Track",{"$f":"Frame_Width-1.5","v":-1.5}]
[{"$f":"IF(ModelNo=B277,9,\"\")","v":""},"A175","Screen Width",{"$f":"CDIM_A175+0.25","v":0.625}]
[{"$f":"IF(ModelNo=B278,10,\"\")","v":""},"A175","Screen Height",{"$f":"IF(Screen_Type=2,Frame_Height-1.5,Frame_Height-1.75)","v":-1.75}]
[{"$f":"IF(ModelNo=B279,11,\"\")","v":""},"A175","Egress Opening Width",{"$f":"Frame_Width-(D269*2)-(2.9*2)-1.01","v":-9.6850000000000005}]
[{"$f":"IF(ModelNo=B280,12,\"\")","v":""},"A175","Egress Opening Height",{"$f":"Frame_Height-3","v":-3}]
[{"$f":"IF(ModelNo=B281,13,\"\")","v":""},"A175","Egress Opening Area (sq.ft.)",{"$f":"ROUNDUP(((D279*D280)/144),4)","v":0.20179999999999998}]
[{"$f":"IF(OR(ModelNo=\"6502\",ModelNo=\"6505\",ModelNo=\"6506\",ModelNo=\"6508\"),1,\"\")","v":""},"6502","Sash Width",{"$f":"IF(TYPE=2,TRUNC(((Frame_Width/2)+1)*16+0.5)/16,TRUNC(((Frame_Width/2)+0.1875)*16+0.5)/16)","v":0.1875}]
[{"$f":"IF(OR(ModelNo=\"6502\",ModelNo=\"6505\",ModelNo=\"6506\",ModelNo=\"6508\"),2,\"\")","v":""},"6502","Sash Height",{"$f":"Frame_Height-3.375","v":-3.375}]
[{"$f":"IF(OR(ModelNo=\"6502\",ModelNo=\"6505\",ModelNo=\"6506\",ModelNo=\"6508\"),3,\"\")","v":""},"6502","Operating Sash Roller Track Length",{"$f":"Frame_Width-8.1875","v":-8.1875}]
[{"$f":"IF(OR(ModelNo=\"6502\",ModelNo=\"6505\",ModelNo=\"6506\",ModelNo=\"6508\"),4,\"\")","v":""},"6502","Screen Roller Track Length",{"$f":"Frame_Width-3.0625","v":-3.0625}]
[{"$f":"IF(OR(ModelNo=\"6502\",ModelNo=\"6505\",ModelNo=\"6506\",ModelNo=\"6508\"),5,\"\")","v":""},"6502","Fixed Panel Support",{"$f":"TRUNC(((Frame_Width/2)-10)*32+0.5)/32","v":-9.96875}]
[{"$f":"IF(OR(ModelNo=\"6502\",ModelNo=\"6505\",ModelNo=\"6506\",ModelNo=\"6508\"),6,\"\")","v":""},"6502","Glass Width",{"$f":"IF(TYPE=2,TRUNC(((Frame_Width/2)-7.875)*16+0.5)/16,TRUNC(((Frame_Width/2)-5.1875)*16+0.5)/16)","v":-5.125}]
[{"$f":"IF(OR(ModelNo=\"6502\",ModelNo=\"6505\",ModelNo=\"6506\",ModelNo=\"6508\"),7,\"\")","v":""},"6502","Glass Height",{"$f":"IF(TYPE=1,TRUNC((Frame_Height-8.6875)*16+0.5)/16,IF(TYPE=2,TRUNC((Frame_Height-12.1875)*32+0.5)/32,IF(TYPE=3,TRUNC((Frame_Height-14.1875)*32+0.5)/32,\"\")))","v":-8.625}]
[{"$f":"IF(OR(ModelNo=\"6502\",ModelNo=\"6505\",ModelNo=\"6506\",ModelNo=\"6508\"),8,\"\")","v":""},"6502","Screen Width",{"$f":"(Frame_Width/2)-0.125","v":-0.125}]
[{"$f":"IF(OR(ModelNo=\"6502\",ModelNo=\"6505\",ModelNo=\"6506\",ModelNo=\"6508\"),9,\"\")","v":""},"6502","Screen Height",{"$f":"Frame_Height-2.9375","v":-2.9375}]
[{"$f":"IF(OR(ModelNo=\"6502\",ModelNo=\"6505\",ModelNo=\"6506\",ModelNo=\"6508\"),10,\"\")","v":""},"6502","Egress Opening Width",{"$f":"TRUNC((Frame_Width-D282-(2.176*2)-4)*16+0.5)/16","v":-8.5}]
[{"$f":"IF(OR(ModelNo=\"6502\",ModelNo=\"6505\",ModelNo=\"6506\",ModelNo=\"6508\"),11,\"\")","v":""},"6502","Egress Opening Height",{"$f":"Frame_Height-(2.25*2)","v":-4.5}]
[{"$f":"IF(OR(ModelNo=\"6502\",ModelNo=\"6505\",ModelNo=\"6506\",ModelNo=\"6508\"),12,\"\")","v":""},"6502","Egress Opening Area (sq.ft.)",{"$f":"ROUNDUP(((D291*D292)/144),4)","v":0.26569999999999999}]
[{"$f":"IF(OR(ModelNo=\"6503\",ModelNo=\"6509\",ModelNo=\"6522\"),1,\"\")","v":""},"6503","Sash Width",{"$f":"IF(TYPE=2,TRUNC(((Frame_Width/3)+0.958)*16+0.5)/16,TRUNC(((Frame_Width/3)+0.333)*16+0.5)/16)","v":0.3125}]
[{"$f":"IF(OR(ModelNo=\"6503\",ModelNo=\"6509\",ModelNo=\"6522\"),2,\"\")","v":""},"6503","Sash Height",{"$f":"Frame_Height-3.375","v":-3.375}]
[{"$f":"IF(OR(ModelNo=\"6503\",ModelNo=\"6509\",ModelNo=\"6522\"),3,\"\")","v":""},"6503","Operating Sash Roller Track Length",{"$f":"Frame_Width-12.375","v":-12.375}]
[{"$f":"IF(OR(ModelNo=\"6503\",ModelNo=\"6509\",ModelNo=\"6522\"),4,\"\")","v":""},"6503","Screen Roller Track Length",{"$f":"Frame_Width-3.0625","v":-3.0625}]
[{"$f":"IF(OR(ModelNo=\"6503\",ModelNo=\"6509\",ModelNo=\"6522\"),5,\"\")","v":""},"6503","Fixed Panel Support",{"$f":"TRUNC(((Frame_Width/3)-9.854)*32+0.5)/32","v":-9.8125}]
[{"$f":"IF(OR(ModelNo=\"6503\",ModelNo=\"6509\",ModelNo=\"6522\"),6,\"\")","v":""},"6503","Glass Width",{"$f":"IF(TYPE=2,TRUNC(((Frame_Width/3)-7.917)*16+0.5)/16,TRUNC(((Frame_Width/3)-5.042)*16+0.5)/16)","v":-5}]
[{"$f":"IF(OR(ModelNo=\"6503\",ModelNo=\"6509\",ModelNo=\"6522\"),7,\"\")","v":""},"6503","Glass Height",{"$f":"IF(TYPE=1,TRUNC((Frame_Height-8.6875)*16+0.5)/16,IF(TYPE=2,TRUNC((Frame_Height-12.1875)*32+0.5)/32,IF(TYPE=3,TRUNC((Frame_Height-14.1875)*32+0.5)/32,\"\")))","v":-8.625}]
[{"$f":"IF(OR(ModelNo=\"6503\",ModelNo=\"6509\",ModelNo=\"6522\"),8,\"\")","v":""},"6503","Screen Width",{"$f":"TRUNC(((Frame_Width/3)+0.021)*16+0.5)/16","v":0}]
[{"$f":"IF(OR(ModelNo=\"6503\",ModelNo=\"6509\",ModelNo=\"6522\"),9,\"\")","v":""},"6503","Screen Height",{"$f":"Frame_Height-2.9375","v":-2.9375}]
[{"$f":"IF(OR(ModelNo=\"6503\",ModelNo=\"6509\",ModelNo=\"6522\"),10,\"\")","v":""},"6503","Egress Opening Width",{"$f":"(TRUNC((Frame_Width-(D294*2)-(2.176*2)-4)*16+0.5)/16)+0.875","v":-8.0625}]
[{"$f":"IF(OR(ModelNo=\"6503\",ModelNo=\"6509\",ModelNo=\"6522\"),11,\"\")","v":""},"6503","Egress Opening Height",{"$f":"Frame_Height-(2.25*2)","v":-4.5}]
[{"$f":"IF(OR(ModelNo=\"6503\",ModelNo=\"6509\",ModelNo=\"6522\"),12,\"\")","v":""},"6503","Egress Opening Area (sq.ft.)",{"$f":"ROUNDUP(((D303*D304)/144),4)","v":0.252}]
[{"$f":"IF(OR(ModelNo=\"6503\",ModelNo=\"6509\",ModelNo=\"6522\"),13,\"\")","v":""},"6503","Center of Meeting Rail (Lock side)",{"$f":"(TRUNC((Frame_Width/3)*16+0.5)/16)+1.3125","v":1.3125}]
[{"$f":"IF(OR(ModelNo=\"6503\",ModelNo=\"6509\",ModelNo=\"6522\"),14,\"\")","v":""},"6503","Center of Meeting Rail (Mullion side)",{"$f":"(TRUNC((Frame_Width/3)*16+0.5)/16)-0.125","v":-0.125}]
[{"$f":"IF(OR(ModelNo=\"6504\",ModelNo=\"6512\"),1,\"\")","v":""},"6504","Sash Width",{"$f":"IF(TYPE=2,TRUNC(((Frame_Width/4)+1.4375)*16+0.5)/16,TRUNC(((Frame_Width/4)+0.625)*16+0.5)/16)","v":0.625}]
[{"$f":"IF(OR(ModelNo=\"6504\",ModelNo=\"6512\"),2,\"\")","v":""},"6504","Sash Height",{"$f":"Frame_Height-3.375","v":-3.375}]
[{"$f":"IF(OR(ModelNo=\"6504\",ModelNo=\"6512\"),3,\"\")","v":""},"6504","Operating Sash Roller Track Length",{"$f":"Frame_Width-12.375","v":-12.375}]
[{"$f":"IF(OR(ModelNo=\"6504\",ModelNo=\"6512\"),4,\"\")","v":""},"6504","Screen Roller Track Length",{"$f":"Frame_Width-3.0625","v":-3.0625}]
[{"$f":"IF(OR(ModelNo=\"6504\",ModelNo=\"6512\"),5,\"\")","v":""},"6504","Fixed Panel Support",{"$f":"TRUNC(((Frame_Width/4)-9.5625)*32+0.5)/32","v":-9.53125}]
[{"$f":"IF(OR(ModelNo=\"6504\",ModelNo=\"6512\"),6,\"\")","v":""},"6504","Glass Width",{"$f":"IF(TYPE=2,TRUNC(((Frame_Width/4)-7.4375)*16+0.5)/16,TRUNC(((Frame_Width/4)-4.75)*16+0.5)/16)","v":-4.6875}]
[{"$f":"IF(OR(ModelNo=\"6504\",ModelNo=\"6512\"),7,\"\")","v":""},"6504","Glass Height",{"$f":"IF(TYPE=1,TRUNC((Frame_Height-8.6875)*16+0.5)/16,IF(TYPE=2,TRUNC((Frame_Height-12.1875)*32+0.5)/32,IF(TYPE=3,TRUNC((Frame_Height-14.1875)*32+0.5)/32,\"\")))","v":-8.625}]
[{"$f":"IF(OR(ModelNo=\"6504\",ModelNo=\"6512\"),8,\"\")","v":""},"6504","Screen Width",{"$f":"TRUNC(((Frame_Width/4)+0.3125)*16+0.5)/16","v":0.3125}]
[{"$f":"IF(OR(ModelNo=\"6504\",ModelNo=\"6512\"),9,\"\")","v":""},"6504","Screen Height",{"$f":"Frame_Height-2.9375","v":-2.9375}]
[{"$f":"IF(OR(ModelNo=\"6504\",ModelNo=\"6512\"),10,\"\")","v":""},"6504","Egress Opening Width",{"$f":"TRUNC(((Frame_Width-(D308+4.375)*2)-2.1875)*16+0.5)/16","v":-12.125}]
[{"$f":"IF(OR(ModelNo=\"6504\",ModelNo=\"6512\"),11,\"\")","v":""},"6504","Egress Opening Height",{"$f":"Frame_Height-(2.25*2)","v":-4.5}]
[{"$f":"IF(OR(ModelNo=\"6504\",ModelNo=\"6512\"),12,\"\")","v":""},"6504","Egress Opening Area (sq.ft.)",{"$f":"ROUNDUP(((D317*D318)/144),4)","v":0.379}]
[{"$f":"IF(OR(ModelNo=\"6504\",ModelNo=\"6512\"),13,\"\")","v":""},"6504","Center of Meeting Rail (Left & Right)",{"$f":"(Frame_Width/4)+0.125","v":0.125}]
[{"$f":"IF(OR(ModelNo=\"A140\",ModelNo=\"A144\",ModelNo=\"A146\",ModelNo=\"A740\",ModelNo=\"A744\",ModelNo=\"A746\",ModelNo=\"A840\",ModelNo=\"A844\",ModelNo=\"A846\"),1,\"\")","v":""},"SHAT","Frame Radius",{"$f":"FrameR","v":{"$error":"#DIV/0!"}}]
[{"$f":"IF(OR(ModelNo=\"A140\",ModelNo=\"A144\",ModelNo=\"A146\",ModelNo=\"A740\",ModelNo=\"A744\",ModelNo=\"A746\",ModelNo=\"A840\",ModelNo=\"A844\",ModelNo=\"A846\"),2,\"\")","v":""},"SHAT","Bottom Sash Width",{"$f":"BSW_SHAT","v":0}]
[{"$f":"IF(OR(ModelNo=\"A140\",ModelNo=\"A144\",ModelNo=\"A146\",ModelNo=\"A740\",ModelNo=\"A744\",ModelNo=\"A746\",ModelNo=\"A840\",ModelNo=\"A844\",ModelNo=\"A846\"),3,\"\")","v":""},"SHAT","Bottom Sash Height",{"$f":"BSH_SHAT","v":0}]
[{"$f":"IF(OR(ModelNo=\"A140\",ModelNo=\"A144\",ModelNo=\"A146\",ModelNo=\"A740\",ModelNo=\"A744\",ModelNo=\"A746\",ModelNo=\"A840\",ModelNo=\"A844\",ModelNo=\"A846\"),4,\"\")","v":""},"SHAT","Bottom Glass Width",{"$f":"BGW_SHAT","v":0}]
[{"$f":"IF(OR(ModelNo=\"A140\",ModelNo=\"A144\",ModelNo=\"A146\",ModelNo=\"A740\",ModelNo=\"A744\",ModelNo=\"A746\",ModelNo=\"A840\",ModelNo=\"A844\",ModelNo=\"A846\"),5,\"\")","v":""},"SHAT","Bottom Glass Height",{"$f":"BGH_SHAT","v":0}]
[{"$f":"IF(OR(ModelNo=\"A140\",ModelNo=\"A144\",ModelNo=\"A146\",ModelNo=\"A740\",ModelNo=\"A744\",ModelNo=\"A746\",ModelNo=\"A840\",ModelNo=\"A844\",ModelNo=\"A846\"),6,\"\")","v":""},"SHAT","Top Glass Radius",{"$f":"GlassR","v":{"$error":"#DIV/0!"}}]
[{"$f":"IF(OR(ModelNo=\"A140\",ModelNo=\"A144\",ModelNo=\"A146\",ModelNo=\"A740\",ModelNo=\"A744\",ModelNo=\"A746\",ModelNo=\"A840\",ModelNo=\"A844\",ModelNo=\"A846\"),7,\"\")","v":""},"SHAT","Top Glass Width",{"$f":"TGW_SHAT","v":0}]
[{"$f":"IF(OR(ModelNo=\"A140\",ModelNo=\"A144\",ModelNo=\"A146\",ModelNo=\"A740\",ModelNo=\"A744\",ModelNo=\"A746\",ModelNo=\"A840\",ModelNo=\"A844\",ModelNo=\"A846\"),8,\"\")","v":""},"SHAT","Top Glass Height",{"$f":"TGH_SHAT","v":0}]
[{"$f":"IF(OR(ModelNo=\"A140\",ModelNo=\"A144\",ModelNo=\"A146\",ModelNo=\"A740\",ModelNo=\"A744\",ModelNo=\"A746\",ModelNo=\"A840\",ModelNo=\"A844\",ModelNo=\"A846\"),9,\"\")","v":""},"SHAT","Top Glass Leg Height",{"$f":"GLASSLEG","v":{"$error":"#DIV/0!"}}]
[{"$f":"IF(OR(ModelNo=\"A140\",ModelNo=\"A144\",ModelNo=\"A146\",ModelNo=\"A740\",ModelNo=\"A744\",ModelNo=\"A746\",ModelNo=\"A840\",ModelNo=\"A844\",ModelNo=\"A846\"),10,\"\")","v":""},"SHAT","Astragal Length",{"$f":"AST_SHAT","v":0}]
[{"$f":"IF(OR(ModelNo=\"A140\",ModelNo=\"A144\",ModelNo=\"A146\",ModelNo=\"A740\",ModelNo=\"A744\",ModelNo=\"A746\",ModelNo=\"A840\",ModelNo=\"A844\",ModelNo=\"A846\"),11,\"\")","v":""},"SHAT","Screen Width",{"$f":"SCREEN_W","v":0}]
[{"$f":"IF(OR(ModelNo=\"A140\",ModelNo=\"A144\",ModelNo=\"A146\",ModelNo=\"A740\",ModelNo=\"A744\",ModelNo=\"A746\",ModelNo=\"A840\",ModelNo=\"A844\",ModelNo=\"A846\"),12,\"\")","v":""},"SHAT","Screen Height",{"$f":"SCREEN_H","v":0}]
[{"$f":"IF(OR(ModelNo=\"A140\",ModelNo=\"A144\",ModelNo=\"A146\",ModelNo=\"A740\",ModelNo=\"A744\",ModelNo=\"A746\",ModelNo=\"A840\",ModelNo=\"A844\",ModelNo=\"A846\"),13,\"\")","v":""},"SHAT","Bottom Sash Weight",{"$f":"IF(ISERROR(BTM_WGT&\" \"&\"lb\"),\"N/A\",BTM_WGT&\" \"&\"lb\")","v":"0 lb"}]
[{"$f":"IF(OR(ModelNo=\"A140\",ModelNo=\"A144\",ModelNo=\"A146\",ModelNo=\"A740\",ModelNo=\"A744\",ModelNo=\"A746\",ModelNo=\"A840\",ModelNo=\"A844\",ModelNo=\"A846\"),14,\"\")","v":""},"SHAT","Balance Size",{"$f":"SHAT_BAL","v":0}]
[{"$f":"IF(OR(ModelNo=\"A140\",ModelNo=\"A144\",ModelNo=\"A146\",ModelNo=\"A740\",ModelNo=\"A744\",ModelNo=\"A746\",ModelNo=\"A840\",ModelNo=\"A844\",ModelNo=\"A846\"),15,\"\")","v":""},"SHAT","Egress Opening Width",{"$f":"IF(ISERROR(EW),\"N/A\",EW)","v":0}]
[{"$f":"IF(OR(ModelNo=\"A140\",ModelNo=\"A144\",ModelNo=\"A146\",ModelNo=\"A740\",ModelNo=\"A744\",ModelNo=\"A746\",ModelNo=\"A840\",ModelNo=\"A844\",ModelNo=\"A846\"),16,\"\")","v":""},"SHAT","Egress Opening Height",{"$f":"IF(ISERROR(EH),\"N/A\",EH)","v":0}]
[{"$f":"IF(OR(ModelNo=\"A140\",ModelNo=\"A144\",ModelNo=\"A146\",ModelNo=\"A740\",ModelNo=\"A744\",ModelNo=\"A746\",ModelNo=\"A840\",ModelNo=\"A844\",ModelNo=\"A846\"),17,\"\")","v":""},"SHAT","Egress Opening Area (sq.ft.)",{"$f":"ROUNDUP(((D335*D336)/144),4)","v":0}]
[{"$f":"IF(ModelNo=B338,1,\"\")","v":""},"72HP","Bottom Glass Width",{"$f":"Frame_Width-2.3125","v":-2.3125}]
[{"$f":"IF(ModelNo=B339,2,\"\")","v":""},"72HP","Bottom Glass Height",{"$f":"IF(TYPE=1,(Frame_Height/2)-Offset,CMR-Offset)","v":0}]
[{"$f":"IF(ModelNo=B340,3,\"\")","v":""},"72HP","Top Glass Width",{"$f":"Frame_Width-2.3125","v":-2.3125}]
[{"$f":"IF(ModelNo=B341,4,\"\")","v":""},"72HP","Top Glass Height",{"$f":"IF(TYPE=1,(Frame_Height/2)-Offset,Frame_Height-CMR-Offset)","v":0}]
[{"$f":"IF(ModelNo=B342,1,\"\")","v":""},"72WP","Left Glass Width",{"$f":"IF(TYPE=1,(Frame_Width/2)-Offset,CMR-Offset)","v":0}]
[{"$f":"IF(ModelNo=B343,2,\"\")","v":""},"72WP","Left Glas Height",{"$f":"Frame_Height-2.3125","v":-2.3125}]
[{"$f":"IF(ModelNo=B344,3,\"\")","v":""},"72WP","Right Glass Width",{"$f":"IF(TYPE=1,(Frame_Width/2)-Offset,Frame_Width-CMR-Offset)","v":0}]
[{"$f":"IF(ModelNo=B345,4,\"\")","v":""},"72WP","Right Glass Height",{"$f":"Frame_Height-2.3125","v":-2.3125}]
[{"$f":"IF(ModelNo=B346,1,\"\")","v":""},"82HP","Bottom Glass Width",{"$f":"Frame_Width-2.5625","v":-2.5625}]
[{"$f":"IF(ModelNo=B347,2,\"\")","v":""},"82HP","Bottom Glass Height",{"$f":"IF(TYPE=1,(Frame_Height/2)-Offset,CMR-Offset)","v":0}]
[{"$f":"IF(ModelNo=B348,3,\"\")","v":""},"82HP","Top Glass Width",{"$f":"Frame_Width-2.5625","v":-2.5625}]
[{"$f":"IF(ModelNo=B349,4,\"\")","v":""},"82HP","Top Glass Height",{"$f":"IF(TYPE=1,(Frame_Height/2)-Offset,Frame_Height-CMR-Offset)","v":0}]
[{"$f":"IF(ModelNo=B350,1,\"\")","v":""},"82WP","Left Glass Width",{"$f":"IF(TYPE=1,(Frame_Width/2)-Offset,CMR-Offset)","v":0}]
[{"$f":"IF(ModelNo=B351,2,\"\")","v":""},"82WP","Left Glas Height",{"$f":"Frame_Height-2.5625","v":-2.5625}]
[{"$f":"IF(ModelNo=B352,3,\"\")","v":""},"82WP","Right Glass Width",{"$f":"IF(TYPE=1,(Frame_Width/2)-Offset,Frame_Width-CMR-Offset)","v":0}]
[{"$f":"IF(ModelNo=B353,4,\"\")","v":""},"82WP","Right Glass Height",{"$f":"Frame_Height-2.5625","v":-2.5625}]
[{"$f":"IF(ModelNo=B354,1,\"\")","v":""},"73HP","Top & Bottom Glass Width",{"$f":"Frame_Width-2.3125","v":-2.3125}]
[{"$f":"IF(ModelNo=B355,2,\"\")","v":""},"73HP","Top & Bottom Glass Height",{"$f":"TRUNC((CDIM_73HP-Offset+TRIPLEHUNG)*16+0.5)/16","v":0}]
[{"$f":"IF(ModelNo=B356,3,\"\")","v":""},"73HP","Center Glass Width",{"$f":"Frame_Width-2.3125","v":-2.3125}]
[{"$f":"IF(ModelNo=B357,4,\"\")","v":""},"73HP","Center Glass Height",{"$f":"TRUNC((Frame_Height-(CDIM_73HP*2)-Offset+(TRIPLEHUNG*2))*16+0.5)/16","v":0}]
[{"$f":"IF(ModelNo=B358,1,\"\")","v":""},"73WP","Left & Right Glass Width",{"$f":"TRUNC((CDIM_73WP-Offset+TRIPLEHUNG)*16+0.5)/16","v":0}]
[{"$f":"IF(ModelNo=B359,2,\"\")","v":""},"73WP","Left & Right Glass Height",{"$f":"Frame_Height-2.3125","v":-2.3125}]
[{"$f":"IF(ModelNo=B360,3,\"\")","v":""},"73WP","Center Glass Width",{"$f":"TRUNC((Frame_Width-(CDIM_73WP*2)-Offset+(TRIPLEHUNG*2))*16+0.5)/16","v":0}]
[{"$f":"IF(ModelNo=B361,4,\"\")","v":""},"73WP","Center Glass Height",{"$f":"Frame_Height-2.3125","v":-2.3125}]
[{"$f":"IF(ModelNo=B362,1,\"\")","v":""},"83HP","Top & Bottom Glass Width",{"$f":"Frame_Width-2.5625","v":-2.5625}]
[{"$f":"IF(ModelNo=B363,2,\"\")","v":""},"83HP","Top & Bottom Glass Height",{"$f":"TRUNC((CDIM_83HP-Offset+TRIPLEHUNG)*16+0.5)/16","v":0}]
[{"$f":"IF(ModelNo=B364,3,\"\")","v":""},"83HP","Center Glass Width",{"$f":"Frame_Width-2.5625","v":-2.5625}]
[{"$f":"IF(ModelNo=B365,4,\"\")","v":""},"83HP","Center Glass Height",{"$f":"TRUNC((Frame_Height-(CDIM_83HP*2)-Offset+(TRIPLEHUNG*2))*16+0.5)/16","v":0}]
[{"$f":"IF(ModelNo=B366,1,\"\")","v":""},"83WP","Left & Right Glass Width",{"$f":"TRUNC((CDIM_83WP-Offset+TRIPLEHUNG)*16+0.5)/16","v":0}]
[{"$f":"IF(ModelNo=B367,2,\"\")","v":""},"83WP","Left & Right Glass Height",{"$f":"Frame_Height-2.5625","v":-2.5625}]
[{"$f":"IF(ModelNo=B368,3,\"\")","v":""},"83WP","Center Glass Width",{"$f":"TRUNC((Frame_Width-(CDIM_83WP*2)-Offset+(TRIPLEHUNG*2))*16+0.5)/16","v":0}]
[{"$f":"IF(ModelNo=B369,4,\"\")","v":""},"83WP","Center Glass Height",{"$f":"Frame_Height-2.5625","v":-2.5625}]
[{"$f":"IF(ModelNo=B370,1,\"\")","v":""},"7SH2","Bottom Sash Width",{"$f":"TRUNC((Frame_Width/2+0.25-2.0625)*32+0.5)/32","v":-1.78125}]
[{"$f":"IF(ModelNo=B371,2,\"\")","v":""},"7SH2","Bottom Sash Height",{"$f":"CDIM_7SH2-0.875","v":-0.875}]
[{"$f":"IF(ModelNo=B372,3,\"\")","v":""},"7SH2","Bottom Glass Width",{"$f":"D370-2.1875","v":-3.96875}]
[{"$f":"IF(ModelNo=B373,4,\"\")","v":""},"7SH2","Bottom Glass Height",{"$f":"D371-2.1875","v":-3.0625}]
[{"$f":"IF(ModelNo=B374,5,\"\")","v":""},"7SH2","Top Glass Width",{"$f":"TRUNC((Frame_Width/2+0.25-2.25)*32+0.5)/32","v":-1.96875}]
[{"$f":"IF(ModelNo=B375,6,\"\")","v":""},"7SH2","Top Glass Height",{"$f":"DDIM_7SH2-1.8125","v":-1.8125}]
[{"$f":"IF(ModelNo=B376,7,\"\")","v":""},"7SH2","Astragal Length",{"$f":"TRUNC((Frame_Width/2-1.5)*32+0.5)/32","v":-1.46875}]
[{"$f":"IF(ModelNo=B377,8,\"\")","v":""},"7SH2","Screen Width",{"$f":"TRUNC((Frame_Width/2+0.25-2.0625)*32+0.5)/32","v":-1.78125}]
[{"$f":"IF(ModelNo=B378,9,\"\")","v":""},"7SH2","Screen Height",{"$f":"CDIM_7SH2-1.8125","v":-1.8125}]
[{"$f":"IF(ModelNo=B379,10,\"\")","v":""},"7SH2","Bottom Sash Weight",{"$f":"IF(ISERROR(BTM_WGT&\" \"&\"lb\"),\"N/A\",BTM_WGT&\" \"&\"lb\")","v":"0 lb"}]
[{"$f":"IF(ModelNo=B380,11,\"\")","v":""},"7SH2","Balance Size (B&T)",{"$f":"IF(ISERROR(BTM_TUBE),\"N/A\",BTM_TUBE)","v":"N/A"}]
[{"$f":"IF(ModelNo=B381,12,\"\")","v":""},"7SH2","Egress Opening Width",{"$f":"IF(ISERROR(EW),\"N/A\",EW)","v":0}]
[{"$f":"IF(ModelNo=B382,13,\"\")","v":""},"7SH2","Egress Opening Height",{"$f":"IF(ISERROR(EH),\"N/A\",EH)","v":0}]
[{"$f":"IF(ModelNo=B383,14,\"\")","v":""},"7SH2","Egress Opening Area (sq.ft.)",{"$f":"ROUNDUP(((D381*D382)/144),4)","v":0}]
[{"$f":"IF(ModelNo=B384,1,\"\")","v":""},"7SH3","Bottom Sash Width",{"$f":"TRUNC((((Frame_Width+0.5)-5.6875)/3)*32)/32","v":-1.71875}]
[{"$f":"IF(ModelNo=B385,2,\"\")","v":""},"7SH3","Bottom Sash Height",{"$f":"CDIM_7SH3-0.875","v":-0.875}]
[{"$f":"IF(ModelNo=B386,3,\"\")","v":""},"7SH3","Bottom Glass Width",{"$f":"D384-2.1875","v":-3.90625}]
[{"$f":"IF(ModelNo=B387,4,\"\")","v":""},"7SH3","Bottom Glass Height",{"$f":"D385-2.1875","v":-3.0625}]
[{"$f":"IF(ModelNo=B388,5,\"\")","v":""},"7SH3","Top Glass Width",{"$f":"TRUNC((((Frame_Width+0.5)-6.25)/3)*32+0.5)/32","v":-1.875}]
[{"$f":"IF(ModelNo=B389,6,\"\")","v":""},"7SH3","Top Glass Height",{"$f":"DDIM_7SH3-1.8125","v":-1.8125}]
[{"$f":"IF(ModelNo=B390,7,\"\")","v":""},"7SH3","Astragal Length",{"$f":"INT((((Frame_Width+0.5)-4.875)/3)*32+0.5)/32","v":-1.46875}]
[{"$f":"IF(ModelNo=B391,8,\"\")","v":""},"7SH3","Screen Width",{"$f":"TRUNC((((Frame_Width+0.5)-5.625)/3)*32+0.5)/32","v":-1.6875}]
[{"$f":"IF(ModelNo=B392,9,\"\")","v":""},"7SH3","Screen Height",{"$f":"CDIM_7SH3-1.8125","v":-1.8125}]
[{"$f":"IF(ModelNo=B393,10,\"\")","v":""},"7SH3","Bottom Sash Weight",{"$f":"IF(ISERROR(BTM_WGT&\" \"&\"lb\"),\"N/A\",BTM_WGT&\" \"&\"lb\")","v":"0 lb"}]
[{"$f":"IF(ModelNo=B394,11,\"\")","v":""},"7SH3","Balance Size (B&T)",{"$f":"IF(ISERROR(BTM_TUBE),\"N/A\",BTM_TUBE)","v":"N/A"}]
[{"$f":"IF(ModelNo=B395,12,\"\")","v":""},"7SH3","Egress Opening Width",{"$f":"IF(ISERROR(EW),\"N/A\",EW)","v":0}]
[{"$f":"IF(ModelNo=B396,13,\"\")","v":""},"7SH3","Egress Opening Height",{"$f":"IF(ISERROR(EH),\"N/A\",EH)","v":0}]
[{"$f":"IF(ModelNo=B397,14,\"\")","v":""},"7SH3","Egress Opening Area (sq.ft.)",{"$f":"ROUNDUP(((D395*D396)/144),4)","v":0}]
[{"$f":"IF(ModelNo=B398,1,\"\")","v":""},"8SH2","Bottom Sash Width",{"$f":"TRUNC((Frame_Width/2-2.3125)*32+0.5)/32","v":-2.28125}]
[{"$f":"IF(ModelNo=B399,2,\"\")","v":""},"8SH2","Bottom Sash Height",{"$f":"CDIM_8SH2-1.5","v":-1.5}]
[{"$f":"IF(ModelNo=B400,3,\"\")","v":""},"8SH2","Bottom Glass Width",{"$f":"D398-2.5625","v":-4.84375}]
[{"$f":"IF(ModelNo=B401,4,\"\")","v":""},"8SH2","Bottom Glass Height",{"$f":"D399-2.5","v":-4}]
[{"$f":"IF(ModelNo=B402,5,\"\")","v":""},"8SH2","Top Glass Width",{"$f":"TRUNC((Frame_Width/2-2.125)*32+0.5)/32","v":-2.09375}]
[{"$f":"IF(ModelNo=B403,6,\"\")","v":""},"8SH2","Top Glass Height",{"$f":"DDIM_8SH2-2","v":-2}]
[{"$f":"IF(ModelNo=B404,7,\"\")","v":""},"8SH2","Astragal Length",{"$f":"TRUNC((Frame_Width/2-1.625)*32+0.5)/32","v":-1.59375}]
[{"$f":"IF(ModelNo=B405,8,\"\")","v":""},"8SH2","Screen Width",{"$f":"TRUNC((Frame_Width/2+0.25-2.1875)*32+0.5)/32","v":-1.90625}]
[{"$f":"IF(ModelNo=B406,9,\"\")","v":""},"8SH2","Screen Height",{"$f":"CDIM_8SH2-1.9375","v":-1.9375}]
[{"$f":"IF(ModelNo=B407,10,\"\")","v":""},"8SH2","Bottom Sash Weight",{"$f":"IF(ISERROR(BTM_WGT&\" \"&\"lb\"),\"N/A\",BTM_WGT&\" \"&\"lb\")","v":"0 lb"}]
[{"$f":"IF(ModelNo=B408,11,\"\")","v":""},"8SH2","Balance Size (B&T)",{"$f":"IF(ISERROR(BTM_TUBE),\"N/A\",BTM_TUBE)","v":"N/A"}]
[{"$f":"IF(ModelNo=B409,12,\"\")","v":""},"8SH2","Egress Opening Width",{"$f":"IF(ISERROR(EW),\"N/A\",EW)","v":0}]
[{"$f":"IF(ModelNo=B410,13,\"\")","v":""},"8SH2","Egress Opening Height",{"$f":"IF(ISERROR(EH),\"N/A\",EH)","v":0}]
[{"$f":"IF(ModelNo=B411,14,\"\")","v":""},"8SH2","Egress Opening Area (sq.ft.)",{"$f":"ROUNDUP(((D409*D410)/144),4)","v":0}]
[{"$f":"IF(ModelNo=B412,1,\"\")","v":""},"8SH3","Bottom Sash Width",{"$f":"TRUNC(((Frame_Width/3)-2.779875+0.57)*32+0.5)/32","v":-2.1875}]
[{"$f":"IF(ModelNo=B413,2,\"\")","v":""},"8SH3","Bottom Sash Height",{"$f":"CDIM_8SH3-1.5","v":-1.5}]
[{"$f":"IF(ModelNo=B414,3,\"\")","v":""},"8SH3","Bottom Glass Width",{"$f":"D412-2.5","v":-4.6875}]
[{"$f":"IF(ModelNo=B415,4,\"\")","v":""},"8SH3","Bottom Glass Height",{"$f":"D413-2.5","v":-4}]
[{"$f":"IF(ModelNo=B416,5,\"\")","v":""},"8SH3","Top Glass Width",{"$f":"TRUNC(((Frame_Width/3)-2.03125)*32+0.5)/32","v":-2}]
[{"$f":"IF(ModelNo=B417,6,\"\")","v":""},"8SH3","Top Glass Height",{"$f":"DDIM_8SH3-2","v":-2}]
[{"$f":"IF(ModelNo=B418,7,\"\")","v":""},"8SH3","Astragal Length",{"$f":"TRUNC(((Frame_Width/3)-1.5)*32+0.5)/32","v":-1.46875}]
[{"$f":"IF(ModelNo=B419,8,\"\")","v":""},"8SH3","Screen Width",{"$f":"TRUNC(((Frame_Width/3)-2.375+0.57)*32+0.5)/32","v":-1.78125}]
[{"$f":"IF(ModelNo=B420,9,\"\")","v":""},"8SH3","Screen Height",{"$f":"CDIM_8SH3-1.9375","v":-1.9375}]
[{"$f":"IF(ModelNo=B421,10,\"\")","v":""},"8SH3","Bottom Sash Weight",{"$f":"IF(ISERROR(BTM_WGT&\" \"&\"lb\"),\"N/A\",BTM_WGT&\" \"&\"lb\")","v":"0 lb"}]
[{"$f":"IF(ModelNo=B422,11,\"\")","v":""},"8SH3","Balance Size (B&T)",{"$f":"IF(ISERROR(BTM_TUBE),\"N/A\",BTM_TUBE)","v":"N/A"}]
[{"$f":"IF(ModelNo=B423,12,\"\")","v":""},"8SH3","Egress Opening Width",{"$f":"IF(ISERROR(EW),\"N/A\",EW)","v":0}]
[{"$f":"IF(ModelNo=B424,13,\"\")","v":""},"8SH3","Egress Opening Height",{"$f":"IF(ISERROR(EH),\"N/A\",EH)","v":0}]
[{"$f":"IF(ModelNo=B425,14,\"\")","v":""},"8SH3","Egress Opening Area (sq.ft.)",{"$f":"ROUNDUP(((D423*D424)/144),4)","v":0}]