{"text_format":"1","workbook":"xlsx","n_sheets":3,"sheets":["Home","Shape Limits","Data"],"not_rendered":{"charts":0,"images":26,"macros":1,"external_links":0,"defined_names":71,"comments":1,"pivot_tables":0},"unopened":[],"bounds":{"document_bytes":16777216,"sheet_cells":100000,"rows_first":2000,"rows_last":500,"rows_between":2000,"halvings":0,"cell_chars":16384,"cell_head_chars":4096},"cells_cut":0,"cells_raw":0,"read":"whole","date_system":"1900"}

{"sheet":"Home","index":0,"n_rows":18,"n_cols":14,"rows_kept":18,"cut":false,"hidden":false,"merged":[[17,10,18,10],[5,12,6,12],[1,2,1,7],[0,11,1,13],[5,13,6,13],[17,13,18,13],[12,3,12,6],[2,3,2,7],[7,3,7,6],[13,2,13,7],[14,2,14,7],[15,2,16,7],[17,2,17,7],[5,11,6,11],[5,10,6,10],[17,12,18,12],[17,11,18,11]]}
[null,null,null,null,null,null,null,null,null,null,null,"Manufacturing Data"]
[null,null,"Absolute Min. Max. Sizes are based on Net Frame Size"]
[null,null,"Model # >>","Windows Min. Max. Look-up",null,null,null,null,null,null,1,{"$f":"VLOOKUP($K3,'Shape Limits'!$S:$U,2,FALSE)","v":{"$error":"#N/A"}},{"$f":"VLOOKUP($K3,'Shape Limits'!$S:$U,3,FALSE)","v":{"$error":"#N/A"}},{"$f":"IF((VLOOKUP($K3,'Shape Limits'!$S:$V,4,FALSE))=1,\"Z\",\"\")","v":{"$error":"#N/A"}}]
[null,null,"Description","Min. W","Min. H","Max. W","Max. H","Max. UI",null,null,2,{"$f":"VLOOKUP($K4,'Shape Limits'!$S:$U,2,FALSE)","v":{"$error":"#N/A"}},{"$f":"VLOOKUP($K4,'Shape Limits'!$S:$U,3,FALSE)","v":{"$error":"#N/A"}},{"$f":"IF((VLOOKUP($K4,'Shape Limits'!$S:$V,4,FALSE))=1,\"Z\",\"\")","v":{"$error":"#N/A"}}]
[null,null,{"$f":"DESCRIPT","v":""},{"$f":"MINW","v":""},{"$f":"MINH","v":""},{"$f":"MAXW","v":""},{"$f":"MAXH","v":""},{"$f":"MAXUI","v":""},null,null,3,{"$f":"VLOOKUP($K5,'Shape Limits'!$S:$U,2,FALSE)","v":{"$error":"#N/A"}},{"$f":"VLOOKUP($K5,'Shape Limits'!$S:$U,3,FALSE)","v":{"$error":"#N/A"}},{"$f":"IF((VLOOKUP($K5,'Shape Limits'!$S:$V,4,FALSE))=1,\"Z\",\"\")","v":{"$error":"#N/A"}}]
[null,null,null,null,null,null,null,null,null,null,4,{"$f":"VLOOKUP($K6,'Shape Limits'!$S:$U,2,FALSE)","v":{"$error":"#N/A"}},{"$f":"VLOOKUP($K6,'Shape Limits'!$S:$U,3,FALSE)","v":{"$error":"#N/A"}},{"$f":"IF((VLOOKUP($K6,'Shape Limits'!$S:$V,4,FALSE))=1,\"Z\",\"\")","v":{"$error":"#N/A"}}]
[]
[null,null,null,"PW / Shapes Min. Max. Look-up",null,null,null,null,null,null,5,{"$f":"VLOOKUP($K8,'Shape Limits'!$S:$U,2,FALSE)","v":{"$error":"#N/A"}},{"$f":"VLOOKUP($K8,'Shape Limits'!$S:$U,3,FALSE)","v":{"$error":"#N/A"}},{"$f":"IF((VLOOKUP($K8,'Shape Limits'!$S:$V,4,FALSE))=1,\"Z\",\"\")","v":{"$error":"#N/A"}}]
[null,null,"Extrusion",null,null,"Model #",null,null,null,null,6,{"$f":"VLOOKUP($K9,'Shape Limits'!$S:$U,2,FALSE)","v":{"$error":"#N/A"}},{"$f":"VLOOKUP($K9,'Shape Limits'!$S:$U,3,FALSE)","v":{"$error":"#N/A"}},{"$f":"IF((VLOOKUP($K9,'Shape Limits'!$S:$V,4,FALSE))=1,\"Z\",\"\")","v":{"$error":"#N/A"}}]
[null,null,null,null,null,null,null,null,null,null,7,{"$f":"VLOOKUP($K10,'Shape Limits'!$S:$U,2,FALSE)","v":{"$error":"#N/A"}},{"$f":"VLOOKUP($K10,'Shape Limits'!$S:$U,3,FALSE)","v":{"$error":"#N/A"}},{"$f":"IF((VLOOKUP($K10,'Shape Limits'!$S:$V,4,FALSE))=1,\"Z\",\"\")","v":{"$error":"#N/A"}}]
[null,null,null,"Width","Height","Dim. 3","Dim. 4",null,null,null,8,{"$f":"VLOOKUP($K11,'Shape Limits'!$S:$U,2,FALSE)","v":{"$error":"#N/A"}},{"$f":"VLOOKUP($K11,'Shape Limits'!$S:$U,3,FALSE)","v":{"$error":"#N/A"}},{"$f":"IF((VLOOKUP($K11,'Shape Limits'!$S:$V,4,FALSE))=1,\"Z\",\"\")","v":{"$error":"#N/A"}}]
[null,null,"PW TIG Lookup",null,null,null,null,null,null,null,9,{"$f":"VLOOKUP($K12,'Shape Limits'!$S:$U,2,FALSE)","v":{"$error":"#N/A"}},{"$f":"VLOOKUP($K12,'Shape Limits'!$S:$U,3,FALSE)","v":{"$error":"#N/A"}},{"$f":"IF((VLOOKUP($K12,'Shape Limits'!$S:$V,4,FALSE))=1,\"Z\",\"\")","v":{"$error":"#N/A"}}]
[null,null,null,null,null,null,null,null,null,null,10,{"$f":"VLOOKUP($K13,'Shape Limits'!$S:$U,2,FALSE)","v":{"$error":"#N/A"}},{"$f":"VLOOKUP($K13,'Shape Limits'!$S:$U,3,FALSE)","v":{"$error":"#N/A"}},{"$f":"IF((VLOOKUP($K13,'Shape Limits'!$S:$V,4,FALSE))=1,\"Z\",\"\")","v":{"$error":"#N/A"}}]
[null,null,{"$f":"IF(AND(SHAPEW>0,OFFSET=0,PWSELECT=1),\"MUST SELECT EXTRUSION TYPE\",\"\")","v":""},null,null,null,null,null,null,null,11,{"$f":"VLOOKUP($K14,'Shape Limits'!$S:$U,2,FALSE)","v":{"$error":"#N/A"}},{"$f":"VLOOKUP($K14,'Shape Limits'!$S:$U,3,FALSE)","v":{"$error":"#N/A"}},{"$f":"IF((VLOOKUP($K14,'Shape Limits'!$S:$V,4,FALSE))=1,\"Z\",\"\")","v":{"$error":"#N/A"}}]
[null,null,{"$f":"IF(AND(SHAPEW>0,SHAPELIMIT>0,EXT>1,PWSELECT=1),\"SIZE IS OUTSIDE LIMITATION\",IF(AND(SHAPEW>0,SHAPEH>0,MAX_IG=1),\"Must Have Tempered Glass\",IF(AND(SHAPEW>0,SHAPEH>0,MAX_IG=2),\"Glass is too large to produce\",\"\")))","v":""},null,null,null,null,null,null,null,12,{"$f":"VLOOKUP($K15,'Shape Limits'!$S:$U,2,FALSE)","v":{"$error":"#N/A"}},{"$f":"VLOOKUP($K15,'Shape Limits'!$S:$U,3,FALSE)","v":{"$error":"#N/A"}},{"$f":"IF((VLOOKUP($K15,'Shape Limits'!$S:$V,4,FALSE))=1,\"Z\",\"\")","v":{"$error":"#N/A"}}]
{"$rows_left_out":4}
{"sheet":"Shape Limits","index":1,"n_rows":315,"n_cols":62,"rows_kept":315,"cut":false,"hidden":true,"merged":[[1,31,1,32],[2,36,2,37],[0,1,0,2],[0,3,0,10],[0,11,0,12],[1,29,1,30]]}
[null,{"$f":"MAX(D5,D12,D22,D31,D41,D49,D59,D71,D83,D91,D103,D114,D125,D134,D146,D158,D170,D182,D194,D206,D219,D228,D239,D251,D262,D274,D286)","v":0},null,"Shapes Min. Max. Limitations",null,null,null,null,null,null,null,{"$f":"IF(O1>\"\",O1,IF(O2>\"\",O2,IF(O3>\"\",O3,IF(O4>\"\",O4,IF(O5>\"\",O5,\"\")))))","v":""},null,null,{"$f":"IF($F$5>\"\",$F$5,IF($F$12>\"\",$F$12,IF($F$22>\"\",$F$22,IF($F$31>\"\",$F$31,IF($F$41>\"\",$F$41,IF($G$49>\"\",$G$49,\"\"))))))","v":""},null,null,{"$f":"IF(R2>0,R2,IF(R3>0,R3,IF(R4>0,R4,0)))","v":0},null,null,null,null,null,null,null,null,null,null,null,null,null,null,null,null,null,null,null,null,null,null,null,null,null,null,null,null,null,null,null,null,null,null,null,null,null,null,null,null,null,null,"Date","Notes:"]
[null,{"$f":"IF(SHAPESELECT=70,\"A77B\",IF(SHAPESELECT=80,\"A78B\",IF(SHAPESELECT=90,\"A79B\",\"A105\")))","v":"A77B"},"Min R","Max W","Max UI","Max Sq.ft",null,"Frame Height:",{"$f":"IF(AND(SHAPEW>0,SHAPE=B2),SHAPEW/2,0)","v":0},null,null,null,null,null,{"$f":"IF(F59>\"\",F59,IF(G71>\"\",G71,IF(F83>\"\",F83,IF(F91>\"\",F91,IF(F103>\"\",F103,IF(F114>\"\",F114,\"\"))))))","v":""},null,null,{"$f":"IF(I6>0,I6,IF(J14>0,J14,IF(I20>0,I20,IF(J29>0,J29,IF(J38>0,J38,IF(J46>0,J46,0))))))","v":0},null,null,null,null,null,null,null,null,null,null,"Description","Min",null,"Max",null,null,null,null,null,null,null,null,null,null,null,3,4,5,6,7,8,9,10,11,12,13,14,null,null,null,null,null,"2011-10-11","7356, 7818 and 7818 changed radius to 9.75 from 9"]
[null,{"$f":"EXT","v":1},{"$f":"MINRADIUS","v":0},{"$f":"MAX_W","v":0},{"$f":"MAX_UI","v":0},{"$f":"MAXSF","v":0},null,"Glass R:",{"$f":"IF(AND(SHAPEW>0,OFFSET>0,SHAPE=B2),I2-OFFSET,0)","v":0},null,null,null,null,null,{"$f":"IF(F125>\"\",F125,IF(G134>\"\",G134,IF(G146>\"\",G146,IF(G158>\"\",G158,IF(G170>\"\",G170,IF(G182>\"\",G182,\"\"))))))","v":""},null,null,{"$f":"IF(K56>0,K56,IF(J68>0,J68,IF(I84>0,I84,IF(J96>0,J96,IF(J97>0,J97,0)))))","v":0},null,null,null,null,null,null,null,null,1,"Select a Model",null,"W","H","W","H","UI",null,null,"Shapes",null,null,null,null,null,null,"EXT","OFFSET","CUTOFFSET","MIN_W","MIN_H","MAXSW","MAX_H","MAXSUI","MINLEG","MAXSF","MAXCUT","MINANGLE",null,null,null,null,null,"2012-08-10","7356, 7818 and 7818 changed radius to 9.75 from 9"]
[null,null,{"$f":"IF(AND(SHAPEW>0,SHAPE=B2,(SHAPEW/2)<C3),1,0)","v":0},{"$f":"IF(AND(SHAPEW>0,OFFSET>0,SHAPE=B2,SHAPEW>D3),1,0)","v":0},{"$f":"IF(AND(SHAPEW>0,OFFSET>0,SHAPE=B2,(SHAPEW+I2)>E3),1,0)","v":0},{"$f":"IF(AND(SHAPEW>0,OFFSET>0,SHAPE=B2,((I2*SHAPEW)/144)>F3),1,0)","v":0},null,"Glass H:",{"$f":"IF(AND(SHAPEW>0,SHAPE=B2),I2-(OFFSET*2),0)","v":0},null,null,null,null,null,{"$f":"IF(G194>\"\",G194,IF(F206>\"\",F206,IF(F219>\"\",F219,IF(F228>\"\",F228,IF(G239>\"\",G239,IF(F251>\"\",F251,\"\"))))))","v":""},null,null,{"$f":"IF(I211>0,I211,IF(I212>0,I212,IF(K259>0,K259,IF(K271>0,K271,0))))","v":0},null,null,null,null,null,null,null,null,2,"3A01 Comp.","Dbl Hung",12,"20",48,84,126,null,1,"Select","Select",null,1,"Select Extrusion",null,"Select Extrusion",1,0,0,0,0,0,0,0,0,0,0,0]
[null,null,{"$f":"MAX(C4:F4)","v":0},{"$f":"IF(AND(SHAPE=B2,C5=1),1,0)","v":0},{"$f":"IF(AND(SHAPEW>0,SHAPEH>0,SHAPE=B2,SHAPEH<>(SHAPEW/2)),1,0)","v":0},{"$f":"IF(AND(SHAPE=B2,E5=1),\"HEIGHT MUST BE 1/2 THE WIDTH\",IF(AND(SHAPE=B2,SHAPEW>0,C4>0),\"RADIUS MUST BE GREATER THAN \"&C3,IF(AND(SHAPE=B2,I5>0,I5<GlassMinW),\"Glass Width is Under Minimum\",IF(AND(SHAPE=B2,I4>0,I4<GlassMinH),\"Glass Height is Under Minimum\",\"\"))))","v":""},null,"Glass W:",{"$f":"IF(AND(SHAPEW>0,SHAPE=B2),2*(SQRT(I4*((2*((SHAPEW/2)-OFFSET))-I4))),0)","v":0},null,null,null,null,null,{"$f":"IF(F262>\"\",F262,IF(G274>\"\",G274,IF(F286>\"\",F286,\"\")))","v":""},null,null,{"$f":"$B$2","v":"A77B"},{"$f":"IF(SHAPE=$B$2,1,0)","v":0},{"$f":"IF(S5>0,\"Frame Width:\",0)","v":0},{"$f":"IF(S5>0,SHAPEW,0)","v":0},null,null,null,null,null,3,"3A01 Steel","Dbl Hung",12,"20","52",96,148,null,2,"A77A","A77A (Full Circle)",null,2,{"$f":"IF(SHAPESELECT=70,\"70 - Frame w/ 1-3/8\"\" NFS\",IF(OR(SHAPESELECT=80,SHAPESELECT=90),\"80/90 - Frame w/ 1-3/8\"\" NFS\",IF(SHAPESELECT=200,\"Mezzo\",\"\")))","v":"70 - Frame w/ 1-3/8\" NFS"},null,"Mezzo",3954,2.09375,2.605,null,null,null,null,null,6,56,7.4375,12]
[null,null,null,null,null,null,null,"Frame Radius:",{"$f":"IF(AND(SHAPEW>0,SHAPE=B2),SHAPEW/2,0)","v":0},null,null,null,null,null,null,null,null,"A77B",{"$f":"IF(SHAPE=$B$2,2,0)","v":0},{"$f":"IF(S6>0,\"Frame Height:\",0)","v":0},{"$f":"IF(S6>0,I2,0)","v":0},null,null,null,null,null,4,"3A02 Comp.","Dbl Slider",18.5,11.25,72,56,128,null,3,"A77B","A77B (Circle Top)",null,3,{"$f":"IF(SHAPESELECT=70,\"70 - Frame w/ 7/8\"\" NFS\",IF(OR(SHAPESELECT=80,SHAPESELECT=90),\"80/90 - Frame w/ 1\"\" NFS\",IF(SHAPESELECT=200,\"Mezzo w/ NF\",\"\")))","v":"70 - Frame w/ 7/8\" NFS"},null,"Mezzo w/ NF","3954F",2.09375,2.605,null,null,null,null,null,6,56,7.4375,12]
[null,null,null,null,null,null,null,null,null,null,null,null,null,null,null,null,null,"A77B",{"$f":"IF(SHAPE=$B$2,3,0)","v":0},{"$f":"IF(S7>0,\"Frame Radius:\",0)","v":0},{"$f":"IF(S7>0,I2,0)","v":0},{"$f":"IF(AND(S7>0,C4>0),1,0)","v":0},null,null,null,null,5,"3A02 Steel","Dbl Slider",18.5,11.25,96,"72",156,null,4,"A77C","A77C (Quarter Arch)",null,4,{"$f":"IF(SHAPESELECT=70,\"70 - Frame w/ J-Channel\",IF(OR(SHAPESELECT=80,SHAPESELECT=90),\"80/90 - Frame w/ Stucco\",IF(SHAPESELECT=200,\"Mezzo w/ Stucco\",\"\")))","v":"70 - Frame w/ J-Channel"},null,"Mezzo w/ Stucco","3954S",2.09375,2.605,null,null,null,null,null,6,56,7.4375,12]
[null,null,null,null,null,null,null,null,null,null,null,null,null,null,null,null,null,"A77B",{"$f":"IF(SHAPE=$B$2,4,0)","v":0},{"$f":"IF(S8>0,\"Glass Radius:\",0)","v":0},{"$f":"IF(S8>0,I3,0)","v":0},null,null,null,null,null,6,"3A03 Comp.","1/4-1/2-14 XOX",47.5,11.25,108,56,164,null,5,"A77D","A77D (Oval)",null,5,{"$f":"IF(SHAPESELECT=70,\"70 - Frame w/ Stucco\",IF(SHAPESELECT=200,\"Platinum\",\"\"))","v":"70 - Frame w/ Stucco"},null,"Platinum","PWFO1",1.125,1.5613999999999999,null,null,null,null,null,6,56,7.4375,8.8000000000000007]
[null,{"$f":"IF(SHAPESELECT=70,\"A77R\",IF(SHAPESELECT=80,\"A78R\",IF(SHAPESELECT=90,\"A79R\",\"A110\")))","v":"A77R"},"Min R","Max W","Max UI","Max H","Min Leg",null,"Frame Height:",{"$f":"IF(AND(SHAPEW>0,SHAPEH>0,SHAPE=B9),SHAPEH,0)","v":0},null,null,null,null,null,null,null,"A77B",{"$f":"IF(SHAPE=$B$2,5,0)","v":0},{"$f":"IF(S9>0,\"Glass Width:\",0)","v":0},{"$f":"IF(S9>0,I5,0)","v":0},{"$f":"IF(AND(U9>0,U9<GlassMinW),1,0)","v":0},null,null,null,null,7,"3A03 Steel","1/4-1/2-14 XOX",47.5,11.25,130,72,"192",null,6,"A77G","A77G (Octagon)",null,6,{"$f":"IF(SHAPESELECT=200,\"Platinum w/ Stucco\",\"\")","v":""},null,"Platinum w/ Stucco","PWFO1-S",1.125,3.0625,null,null,null,null,null,6,56,7.4375,8.8000000000000007]
[null,{"$f":"EXT","v":1},{"$f":"MINRADIUS","v":0},{"$f":"MAX_W","v":0},{"$f":"MAX_UI","v":0},{"$f":"MAX_H","v":0},6.25E-2,null,"Glass W:",{"$f":"IF(AND(SHAPEW>0,SHAPEH>0,OFFSET>0,SHAPE=B9),SHAPEW-(OFFSET*2),0)","v":0},null,null,null,null,null,null,null,"A77B",{"$f":"IF(SHAPE=$B$2,6,0)","v":0},{"$f":"IF(S10>0,\"Glass Height:\",0)","v":0},{"$f":"IF(S10>0,I4,0)","v":0},{"$f":"IF(AND(U10>0,U10<GlassMinH),1,0)","v":0},null,null,null,null,8,"3A04","PW",9.5,9.5,120,120,180,null,7,"A77H","A77H (Half Octagon)",null,1,{"$f":"VLOOKUP(EXTR,EXTLIST,2,FALSE)","v":"Select Extrusion"},null,"70 - Frame w/ 1-3/8\" NFS",7356,1.15625,1.748,null,null,null,null,null,6,56,7.4375,8.5]
[null,null,{"$f":"IF(AND(SHAPEW>0,SHAPE=B9,(SHAPEW/2)<C10),1,0)","v":0},{"$f":"IF(AND(SHAPEW>0,OFFSET>0,SHAPE=B9,SHAPEW>D10),1,0)","v":0},{"$f":"IF(AND(SHAPEW>0,OFFSET>0,SHAPE=B9,(SHAPEW+SHAPEH)>E10),1,0)","v":0},{"$f":"IF(AND(SHAPEW>0,OFFSET>0,SHAPE=B9,SHAPEH>F10),1,0)","v":0},{"$f":"IF(AND(SHAPEW>0,SHAPEH>0,SHAPE=B9,(SHAPEH-SHAPEW/2)<G10),1,0)","v":0},null,"Glass H:",{"$f":"IF(AND(SHAPEW>0,SHAPEH>0,OFFSET>0,SHAPE=B9),SHAPEH-(OFFSET*2),0)","v":0},null,null,null,null,null,null,null,"A77B",{"$f":"IF(SHAPE=$B$2,7,0)","v":0},{"$f":"IF(S11>0,\"Max Width:\",0)","v":0},{"$f":"IF(S11>0,D3,0)","v":0},{"$f":"IF(AND(S11>0,SHAPEW>0,SHAPEW>U11),1,0)","v":0},null,null,null,null,9,"3A09 Comp.","1/3-1/3-1/3 XOX",37.25,11.25,108,56,164,null,8,"A77J","A77J (1/4 Octagon)",null,null,null,null,"70 - Frame w/ 7/8\" NFS",7818,1.15625,1.748,null,null,null,null,null,6,56,7.4375,8.5]
[null,null,{"$f":"MAX(C11:G11)","v":0},{"$f":"IF(AND(SHAPE=B9,C12=1),1,0)","v":0},{"$f":"IF(AND(SHAPEW>0,OFFSET>0,DIM_4>0,SHAPEH>0,SHAPE=B9,(SHAPEH-DIM_4)<>(SHAPEW/2)),1,0)","v":0},{"$f":"IF(AND(SHAPE=B9,E12=1),\"HEIGHT MUST BE 1/2 THE WIDTH + DIM4\",IF(AND(SHAPE=B9,SHAPEW>0,C11>0),\"RADIUS MUST BE GREATER THAN \"&C10,IF(AND(SHAPE=B9,J10>0,J10<GlassMinW),\"Glass Width is Under Minimum\",IF(AND(SHAPE=B9,J11>0,J11<GlassMinH),\"Glass Height is Under Minimum\",\"\"))))","v":""},null,null,"Glass Leg H:",{"$f":"IF(AND(SHAPEW>0,SHAPEH>0,OFFSET>0,SHAPE=B9),(SHAPEH-SHAPEW/2)-OFFSET,0)","v":0},null,null,null,null,null,null,null,"A77B",{"$f":"IF(SHAPE=$B$2,8,0)","v":0},{"$f":"IF(S12>0,\"Max UI:\",0)","v":0},{"$f":"IF(S12>0,E3,0)","v":0},{"$f":"IF(AND(S12>0,F4>0),1,0)","v":0},null,null,null,null,10,"3A09 Steel","1/3-1/3-1/3 XOX",37.25,11.25,130,72,"192",null,9,"A77K","A77K (Eyebrow)",null,null,null,null,"70 - Frame w/ J-Channel",7358,1.15625,1.748,null,null,null,null,null,6,56,7.4375,8.5]
[null,null,null,null,null,null,null,null,"Glass R:",{"$f":"IF(AND(SHAPEW>0,SHAPEH>0,OFFSET>0,SHAPE=B9),(SHAPEW/2)-OFFSET,0)","v":0},null,null,null,null,null,null,null,{"$f":"$B$9","v":"A77R"},{"$f":"IF(SHAPE=$B$9,1,0)","v":0},{"$f":"IF(S13>0,\"Frame Width:\",0)","v":0},{"$f":"IF(S13>0,SHAPEW,0)","v":0},null,null,null,null,null,11,"03S0 Comp.","Sgl Hung",12,22,48,78,126,null,10,"A77L","A77L (Half Eyebrow)",null,null,null,null,"70 - Frame w/ Stucco",10000,1.15625,3.375,null,null,null,null,null,6,56,7.4375,8.5]
[null,null,null,null,null,null,null,null,"Frame Radius:",{"$f":"IF(AND(SHAPEW>0,SHAPEH>0,SHAPE=B9),SHAPEW/2,0)","v":0},null,null,null,null,null,null,null,"A77R",{"$f":"IF(SHAPE=$B$9,2,0)","v":0},{"$f":"IF(S14>0,\"Frame Height:\",0)","v":0},{"$f":"IF(S14>0,J9,0)","v":0},null,null,null,null,null,12,"03S0 Steel","Sgl Hung",12,22,52,96,148,null,11,"A77N","A77N (Isosceles Triangle)",null,null,null,null,"80/90 - Frame w/ 1-3/8\" NFS",8542,1.28125,1.873,null,null,null,null,null,6,56,7.4375,12]
[null,null,null,null,null,null,null,null,null,null,null,null,null,null,null,null,null,"A77R",{"$f":"IF(SHAPE=$B$9,3,0)","v":0},{"$f":"IF(S15>0,\"Frame Radius:\",0)","v":0},{"$f":"IF(S15>0,SHAPEW/2,0)","v":0},{"$f":"IF(AND(S15>0,C11>0),1,0)","v":0},null,null,null,null,13,"03S2 Comp.","Sgl Slider",18.5,12,72,56,128,null,12,"A77P","A77P (Right Triangle)",null,null,null,null,"80/90 - Frame w/ 1\" NFS",9934,1.28125,1.873,null,null,null,null,null,6,56,7.4375,12]
{"$rows_left_out":301}
{"sheet":"Data","index":2,"n_rows":156,"n_cols":83,"rows_kept":156,"cut":false,"hidden":true,"merged":[]}
[]
[null,"Min. Width","A77A","A77B","A77C","A77D","A77G","A77H","A77J","A77K","A77L","A77N","A77P","A77Q","A77R","A77S","A77U","A77V","A77W","A77Y","A77Z","A78A","A78B","A78C","A78D","A78G","A78H","A78J","A78K","A78L","A78N","A78P","A78Q","A78R","A78S","A78U","A78V","A78W","A78Y","A78Z","A79A","A79B","A79C","A79D","A79G","A79H","A79J","A79K","A79L","A79N","A79P","A79Q","A79R","A79S","A79U","A79V","A79W","A79Y","A79Z","A105","A110","A111","A112","A113","A114","A115","A116","A117","A118","A119","A120","A121","A122","A123","A124","A125","A126","A127","A128","A129","A130","A131","A132"]
[null,"Mezzo",null,null,null,null,null,null,null,null,null,null,null,null,null,null,null,null,null,null,null,null,null,null,null,null,null,null,null,null,null,null,null,null,null,null,null,null,null,null,null,null,null,null,null,null,null,null,null,null,null,null,null,null,null,null,null,null,null,25,25,12.5,12.5,25,14,13,13,36,24,29,18,18,18,18,12,18,18,18,18,12,16,15,14]
[null,"Mezzo w/ NF",null,null,null,null,null,null,null,null,null,null,null,null,null,null,null,null,null,null,null,null,null,null,null,null,null,null,null,null,null,null,null,null,null,null,null,null,null,null,null,null,null,null,null,null,null,null,null,null,null,null,null,null,null,null,null,null,null,25,25,12.5,12.5,25,14,13,13,36,24,29,18,18,18,18,12,18,18,18,18,12,16,15,14]
[null,"Mezzo w/ Stucco",null,null,null,null,null,null,null,null,null,null,null,null,null,null,null,null,null,null,null,null,null,null,null,null,null,null,null,null,null,null,null,null,null,null,null,null,null,null,null,null,null,null,null,null,null,null,null,null,null,null,null,null,null,null,null,null,null,27,27,13.5,13.5,25,14,13.5,13.5,36,24,29,18,18,18,18,12,18,18,18,18,12,16,15,14]
[null,"Platinum",null,null,null,null,null,null,null,null,null,null,null,null,null,null,null,null,null,null,null,null,null,null,null,null,null,null,null,null,null,null,null,null,null,null,null,null,null,null,null,null,null,null,null,null,null,null,null,null,null,null,null,null,null,null,null,null,null,20,20,11.5,11.5,20,12,13,13,36,20,24,16,16,16,16,12,18,18,18,18,12,16,15,14]
[null,"Platinum w/ Stucco",null,null,null,null,null,null,null,null,null,null,null,null,null,null,null,null,null,null,null,null,null,null,null,null,null,null,null,null,null,null,null,null,null,null,null,null,null,null,null,null,null,null,null,null,null,null,null,null,null,null,null,null,null,null,null,null,null,20,20,11.5,11.5,20,12,13,13,36,20,24,16,16,16,16,12,18,18,18,18,12,16,15,14]
[null,"70 - Frame w/ 1-3/8\" NFS",20,20,10,20,16,12,12,20,10,10,10,10,18,12,10,15,10,12,12]
[null,"70 - Frame w/ 7/8\" NFS",20,20,10,20,16,12,12,20,10,10,10,10,18,12,10,15,10,12,12]
[null,"70 - Frame w/ J-Channel",20,20,10,20,16,12,12,20,10,10,10,10,18,12,10,15,10,12,12]
[null,"70 - Frame w/ Stucco",23.5,23.5,11.75,23.5,16,12,12,25,11.75,12,12,12,23.5,12,12,15,10,12,12]
[null,"80/90 - Frame w/ 1-3/8\" NFS",null,null,null,null,null,null,null,null,null,null,null,null,null,null,null,null,null,null,null,23.5,23.5,11.75,23.5,16,12,12,25,11.75,12,12,12,23.5,12,12,15,10,12,12,23.5,23.5,11.75,23.5,16,12,12,25,11.75,12,12,12,23.5,12,12,15,10,12,12]
[null,"80/90 - Frame w/ 1\" NFS",null,null,null,null,null,null,null,null,null,null,null,null,null,null,null,null,null,null,null,23.5,23.5,11.75,23.5,16,12,12,25,11.75,12,12,12,23.5,12,12,15,10,12,12,23.5,23.5,11.75,23.5,16,12,12,25,11.75,12,12,12,23.5,12,12,15,10,12,12]
[null,"80/90 - Frame w/ Stucco",null,null,null,null,null,null,null,null,null,null,null,null,null,null,null,null,null,null,null,23.5,23.5,11.75,23.5,16,12,12,25,11.75,12,12,12,23.5,12,12,15,10,12,12,23.5,23.5,11.75,23.5,16,12,12,25,11.75,12,12,12,23.5,12,12,15,10,12,12]
[null,null,{"$f":"IF(EXTR>1,VLOOKUP(EXTSELECT,MINWIDTHTABLE,2,FALSE),0)","v":0},{"$f":"IF(EXTR>1,VLOOKUP(EXTSELECT,MINWIDTHTABLE,3,FALSE),0)","v":0},{"$f":"IF(EXTR>1,VLOOKUP(EXTSELECT,MINWIDTHTABLE,4,FALSE),0)","v":0},{"$f":"IF(EXTR>1,VLOOKUP(EXTSELECT,MINWIDTHTABLE,5,FALSE),0)","v":0},{"$f":"IF(EXTR>1,VLOOKUP(EXTSELECT,MINWIDTHTABLE,6,FALSE),0)","v":0},{"$f":"IF(EXTR>1,VLOOKUP(EXTSELECT,MINWIDTHTABLE,7,FALSE),0)","v":0},{"$f":"IF(EXTR>1,VLOOKUP(EXTSELECT,MINWIDTHTABLE,8,FALSE),0)","v":0},{"$f":"IF(EXTR>1,VLOOKUP(EXTSELECT,MINWIDTHTABLE,9,FALSE),0)","v":0},{"$f":"IF(EXTR>1,VLOOKUP(EXTSELECT,MINWIDTHTABLE,10,FALSE),0)","v":0},{"$f":"IF(EXTR>1,VLOOKUP(EXTSELECT,MINWIDTHTABLE,11,FALSE),0)","v":0},{"$f":"IF(EXTR>1,VLOOKUP(EXTSELECT,MINWIDTHTABLE,12,FALSE),0)","v":0},{"$f":"IF(EXTR>1,VLOOKUP(EXTSELECT,MINWIDTHTABLE,13,FALSE),0)","v":0},{"$f":"IF(EXTR>1,VLOOKUP(EXTSELECT,MINWIDTHTABLE,14,FALSE),0)","v":0},{"$f":"IF(EXTR>1,VLOOKUP(EXTSELECT,MINWIDTHTABLE,15,FALSE),0)","v":0},{"$f":"IF(EXTR>1,VLOOKUP(EXTSELECT,MINWIDTHTABLE,16,FALSE),0)","v":0},{"$f":"IF(EXTR>1,VLOOKUP(EXTSELECT,MINWIDTHTABLE,17,FALSE),0)","v":0},{"$f":"IF(EXTR>1,VLOOKUP(EXTSELECT,MINWIDTHTABLE,18,FALSE),0)","v":0},{"$f":"IF(EXTR>1,VLOOKUP(EXTSELECT,MINWIDTHTABLE,19,FALSE),0)","v":0},{"$f":"IF(EXTR>1,VLOOKUP(EXTSELECT,MINWIDTHTABLE,20,FALSE),0)","v":0},{"$f":"IF(EXTR>1,VLOOKUP(EXTSELECT,MINWIDTHTABLE,21,FALSE),0)","v":0},{"$f":"IF(EXTR>1,VLOOKUP(EXTSELECT,MINWIDTHTABLE,22,FALSE),0)","v":0},{"$f":"IF(EXTR>1,VLOOKUP(EXTSELECT,MINWIDTHTABLE,23,FALSE),0)","v":0},{"$f":"IF(EXTR>1,VLOOKUP(EXTSELECT,MINWIDTHTABLE,24,FALSE),0)","v":0},{"$f":"IF(EXTR>1,VLOOKUP(EXTSELECT,MINWIDTHTABLE,25,FALSE),0)","v":0},{"$f":"IF(EXTR>1,VLOOKUP(EXTSELECT,MINWIDTHTABLE,26,FALSE),0)","v":0},{"$f":"IF(EXTR>1,VLOOKUP(EXTSELECT,MINWIDTHTABLE,27,FALSE),0)","v":0},{"$f":"IF(EXTR>1,VLOOKUP(EXTSELECT,MINWIDTHTABLE,28,FALSE),0)","v":0},{"$f":"IF(EXTR>1,VLOOKUP(EXTSELECT,MINWIDTHTABLE,29,FALSE),0)","v":0},{"$f":"IF(EXTR>1,VLOOKUP(EXTSELECT,MINWIDTHTABLE,30,FALSE),0)","v":0},{"$f":"IF(EXTR>1,VLOOKUP(EXTSELECT,MINWIDTHTABLE,31,FALSE),0)","v":0},{"$f":"IF(EXTR>1,VLOOKUP(EXTSELECT,MINWIDTHTABLE,32,FALSE),0)","v":0},{"$f":"IF(EXTR>1,VLOOKUP(EXTSELECT,MINWIDTHTABLE,33,FALSE),0)","v":0},{"$f":"IF(EXTR>1,VLOOKUP(EXTSELECT,MINWIDTHTABLE,34,FALSE),0)","v":0},{"$f":"IF(EXTR>1,VLOOKUP(EXTSELECT,MINWIDTHTABLE,35,FALSE),0)","v":0},{"$f":"IF(EXTR>1,VLOOKUP(EXTSELECT,MINWIDTHTABLE,36,FALSE),0)","v":0},{"$f":"IF(EXTR>1,VLOOKUP(EXTSELECT,MINWIDTHTABLE,37,FALSE),0)","v":0},{"$f":"IF(EXTR>1,VLOOKUP(EXTSELECT,MINWIDTHTABLE,38,FALSE),0)","v":0},{"$f":"IF(EXTR>1,VLOOKUP(EXTSELECT,MINWIDTHTABLE,39,FALSE),0)","v":0},{"$f":"IF(EXTR>1,VLOOKUP(EXTSELECT,MINWIDTHTABLE,40,FALSE),0)","v":0},{"$f":"IF(EXTR>1,VLOOKUP(EXTSELECT,MINWIDTHTABLE,41,FALSE),0)","v":0},{"$f":"IF(EXTR>1,VLOOKUP(EXTSELECT,MINWIDTHTABLE,42,FALSE),0)","v":0},{"$f":"IF(EXTR>1,VLOOKUP(EXTSELECT,MINWIDTHTABLE,43,FALSE),0)","v":0},{"$f":"IF(EXTR>1,VLOOKUP(EXTSELECT,MINWIDTHTABLE,44,FALSE),0)","v":0},{"$f":"IF(EXTR>1,VLOOKUP(EXTSELECT,MINWIDTHTABLE,45,FALSE),0)","v":0},{"$f":"IF(EXTR>1,VLOOKUP(EXTSELECT,MINWIDTHTABLE,46,FALSE),0)","v":0},{"$f":"IF(EXTR>1,VLOOKUP(EXTSELECT,MINWIDTHTABLE,47,FALSE),0)","v":0},{"$f":"IF(EXTR>1,VLOOKUP(EXTSELECT,MINWIDTHTABLE,48,FALSE),0)","v":0},{"$f":"IF(EXTR>1,VLOOKUP(EXTSELECT,MINWIDTHTABLE,49,FALSE),0)","v":0},{"$f":"IF(EXTR>1,VLOOKUP(EXTSELECT,MINWIDTHTABLE,50,FALSE),0)","v":0},{"$f":"IF(EXTR>1,VLOOKUP(EXTSELECT,MINWIDTHTABLE,51,FALSE),0)","v":0},{"$f":"IF(EXTR>1,VLOOKUP(EXTSELECT,MINWIDTHTABLE,52,FALSE),0)","v":0},{"$f":"IF(EXTR>1,VLOOKUP(EXTSELECT,MINWIDTHTABLE,53,FALSE),0)","v":0},{"$f":"IF(EXTR>1,VLOOKUP(EXTSELECT,MINWIDTHTABLE,54,FALSE),0)","v":0},{"$f":"IF(EXTR>1,VLOOKUP(EXTSELECT,MINWIDTHTABLE,55,FALSE),0)","v":0},{"$f":"IF(EXTR>1,VLOOKUP(EXTSELECT,MINWIDTHTABLE,56,FALSE),0)","v":0},{"$f":"IF(EXTR>1,VLOOKUP(EXTSELECT,MINWIDTHTABLE,57,FALSE),0)","v":0},{"$f":"IF(EXTR>1,VLOOKUP(EXTSELECT,MINWIDTHTABLE,58,FALSE),0)","v":0},{"$f":"IF(EXTR>1,VLOOKUP(EXTSELECT,MINWIDTHTABLE,59,FALSE),0)","v":0},{"$f":"IF(EXTR>1,VLOOKUP(EXTSELECT,MINWIDTHTABLE,60,FALSE),0)","v":0},{"$f":"IF(EXTR>1,VLOOKUP(EXTSELECT,MINWIDTHTABLE,61,FALSE),0)","v":0},{"$f":"IF(EXTR>1,VLOOKUP(EXTSELECT,MINWIDTHTABLE,62,FALSE),0)","v":0},{"$f":"IF(EXTR>1,VLOOKUP(EXTSELECT,MINWIDTHTABLE,63,FALSE),0)","v":0},{"$f":"IF(EXTR>1,VLOOKUP(EXTSELECT,MINWIDTHTABLE,64,FALSE),0)","v":0},{"$f":"IF(EXTR>1,VLOOKUP(EXTSELECT,MINWIDTHTABLE,65,FALSE),0)","v":0},{"$f":"IF(EXTR>1,VLOOKUP(EXTSELECT,MINWIDTHTABLE,66,FALSE),0)","v":0},{"$f":"IF(EXTR>1,VLOOKUP(EXTSELECT,MINWIDTHTABLE,67,FALSE),0)","v":0},{"$f":"IF(EXTR>1,VLOOKUP(EXTSELECT,MINWIDTHTABLE,68,FALSE),0)","v":0},{"$f":"IF(EXTR>1,VLOOKUP(EXTSELECT,MINWIDTHTABLE,69,FALSE),0)","v":0},{"$f":"IF(EXTR>1,VLOOKUP(EXTSELECT,MINWIDTHTABLE,70,FALSE),0)","v":0},{"$f":"IF(EXTR>1,VLOOKUP(EXTSELECT,MINWIDTHTABLE,71,FALSE),0)","v":0},{"$f":"IF(EXTR>1,VLOOKUP(EXTSELECT,MINWIDTHTABLE,72,FALSE),0)","v":0},{"$f":"IF(EXTR>1,VLOOKUP(EXTSELECT,MINWIDTHTABLE,73,FALSE),0)","v":0},{"$f":"IF(EXTR>1,VLOOKUP(EXTSELECT,MINWIDTHTABLE,74,FALSE),0)","v":0},{"$f":"IF(EXTR>1,VLOOKUP(EXTSELECT,MINWIDTHTABLE,75,FALSE),0)","v":0},{"$f":"IF(EXTR>1,VLOOKUP(EXTSELECT,MINWIDTHTABLE,76,FALSE),0)","v":0},{"$f":"IF(EXTR>1,VLOOKUP(EXTSELECT,MINWIDTHTABLE,77,FALSE),0)","v":0},{"$f":"IF(EXTR>1,VLOOKUP(EXTSELECT,MINWIDTHTABLE,78,FALSE),0)","v":0},{"$f":"IF(EXTR>1,VLOOKUP(EXTSELECT,MINWIDTHTABLE,79,FALSE),0)","v":0},{"$f":"IF(EXTR>1,VLOOKUP(EXTSELECT,MINWIDTHTABLE,80,FALSE),0)","v":0},{"$f":"IF(EXTR>1,VLOOKUP(EXTSELECT,MINWIDTHTABLE,81,FALSE),0)","v":0},{"$f":"IF(EXTR>1,VLOOKUP(EXTSELECT,MINWIDTHTABLE,82,FALSE),0)","v":0}]
{"$rows_left_out":141}