{"text_format":"1","workbook":"xlsx","n_sheets":3,"sheets":["Home","Shape Limits","Data"],"not_rendered":{"charts":0,"images":26,"macros":1,"external_links":0,"defined_names":71,"comments":1,"pivot_tables":0},"unopened":[],"bounds":{"document_bytes":16777216,"sheet_cells":100000,"rows_first":2000,"rows_last":500,"rows_between":2000,"halvings":0,"cell_chars":16384,"cell_head_chars":4096},"cells_cut":0,"cells_raw":0,"read":"whole","date_system":"1900"}

{"sheet":"Home","index":0,"n_rows":18,"n_cols":14,"rows_kept":18,"cut":false,"hidden":false,"merged":[[17,10,18,10],[5,12,6,12],[1,2,1,7],[0,11,1,13],[5,13,6,13],[17,13,18,13],[12,3,12,6],[2,3,2,7],[7,3,7,6],[13,2,13,7],[14,2,14,7],[15,2,16,7],[17,2,17,7],[5,11,6,11],[5,10,6,10],[17,12,18,12],[17,11,18,11]]}
[null,null,null,null,null,null,null,null,null,null,null,"Manufacturing Data"]
[null,null,"Absolute Min. Max. Sizes are based on Net Frame Size"]
[null,null,"Model # >>","Windows Min. Max. Look-up",null,null,null,null,null,null,1,{"$f":"VLOOKUP($K3,'Shape Limits'!$S:$U,2,FALSE)","v":{"$error":"#N/A"}},{"$f":"VLOOKUP($K3,'Shape Limits'!$S:$U,3,FALSE)","v":{"$error":"#N/A"}},{"$f":"IF((VLOOKUP($K3,'Shape Limits'!$S:$V,4,FALSE))=1,\"Z\",\"\")","v":{"$error":"#N/A"}}]
[null,null,"Description","Min. W","Min. H","Max. W","Max. H","Max. UI",null,null,2,{"$f":"VLOOKUP($K4,'Shape Limits'!$S:$U,2,FALSE)","v":{"$error":"#N/A"}},{"$f":"VLOOKUP($K4,'Shape Limits'!$S:$U,3,FALSE)","v":{"$error":"#N/A"}},{"$f":"IF((VLOOKUP($K4,'Shape Limits'!$S:$V,4,FALSE))=1,\"Z\",\"\")","v":{"$error":"#N/A"}}]
[null,null,{"$f":"DESCRIPT","v":""},{"$f":"MINW","v":""},{"$f":"MINH","v":""},{"$f":"MAXW","v":""},{"$f":"MAXH","v":""},{"$f":"MAXUI","v":""},null,null,3,{"$f":"VLOOKUP($K5,'Shape Limits'!$S:$U,2,FALSE)","v":{"$error":"#N/A"}},{"$f":"VLOOKUP($K5,'Shape Limits'!$S:$U,3,FALSE)","v":{"$error":"#N/A"}},{"$f":"IF((VLOOKUP($K5,'Shape Limits'!$S:$V,4,FALSE))=1,\"Z\",\"\")","v":{"$error":"#N/A"}}]
[null,null,null,null,null,null,null,null,null,null,4,{"$f":"VLOOKUP($K6,'Shape Limits'!$S:$U,2,FALSE)","v":{"$error":"#N/A"}},{"$f":"VLOOKUP($K6,'Shape Limits'!$S:$U,3,FALSE)","v":{"$error":"#N/A"}},{"$f":"IF((VLOOKUP($K6,'Shape Limits'!$S:$V,4,FALSE))=1,\"Z\",\"\")","v":{"$error":"#N/A"}}]
[]
[null,null,null,"PW / Shapes Min. Max. Look-up",null,null,null,null,null,null,5,{"$f":"VLOOKUP($K8,'Shape Limits'!$S:$U,2,FALSE)","v":{"$error":"#N/A"}},{"$f":"VLOOKUP($K8,'Shape Limits'!$S:$U,3,FALSE)","v":{"$error":"#N/A"}},{"$f":"IF((VLOOKUP($K8,'Shape Limits'!$S:$V,4,FALSE))=1,\"Z\",\"\")","v":{"$error":"#N/A"}}]
[null,null,"Extrusion",null,null,"Model #",null,null,null,null,6,{"$f":"VLOOKUP($K9,'Shape Limits'!$S:$U,2,FALSE)","v":{"$error":"#N/A"}},{"$f":"VLOOKUP($K9,'Shape Limits'!$S:$U,3,FALSE)","v":{"$error":"#N/A"}},{"$f":"IF((VLOOKUP($K9,'Shape Limits'!$S:$V,4,FALSE))=1,\"Z\",\"\")","v":{"$error":"#N/A"}}]
[null,null,null,null,null,null,null,null,null,null,7,{"$f":"VLOOKUP($K10,'Shape Limits'!$S:$U,2,FALSE)","v":{"$error":"#N/A"}},{"$f":"VLOOKUP($K10,'Shape Limits'!$S:$U,3,FALSE)","v":{"$error":"#N/A"}},{"$f":"IF((VLOOKUP($K10,'Shape Limits'!$S:$V,4,FALSE))=1,\"Z\",\"\")","v":{"$error":"#N/A"}}]
[null,null,null,"Width","Height","Dim. 3","Dim. 4",null,null,null,8,{"$f":"VLOOKUP($K11,'Shape Limits'!$S:$U,2,FALSE)","v":{"$error":"#N/A"}},{"$f":"VLOOKUP($K11,'Shape Limits'!$S:$U,3,FALSE)","v":{"$error":"#N/A"}},{"$f":"IF((VLOOKUP($K11,'Shape Limits'!$S:$V,4,FALSE))=1,\"Z\",\"\")","v":{"$error":"#N/A"}}]
[null,null,"PW TIG Lookup",null,null,null,null,null,null,null,9,{"$f":"VLOOKUP($K12,'Shape Limits'!$S:$U,2,FALSE)","v":{"$error":"#N/A"}},{"$f":"VLOOKUP($K12,'Shape Limits'!$S:$U,3,FALSE)","v":{"$error":"#N/A"}},{"$f":"IF((VLOOKUP($K12,'Shape Limits'!$S:$V,4,FALSE))=1,\"Z\",\"\")","v":{"$error":"#N/A"}}]
[null,null,null,null,null,null,null,null,null,null,10,{"$f":"VLOOKUP($K13,'Shape Limits'!$S:$U,2,FALSE)","v":{"$error":"#N/A"}},{"$f":"VLOOKUP($K13,'Shape Limits'!$S:$U,3,FALSE)","v":{"$error":"#N/A"}},{"$f":"IF((VLOOKUP($K13,'Shape Limits'!$S:$V,4,FALSE))=1,\"Z\",\"\")","v":{"$error":"#N/A"}}]
[null,null,{"$f":"IF(AND(SHAPEW>0,OFFSET=0,PWSELECT=1),\"MUST SELECT EXTRUSION TYPE\",\"\")","v":""},null,null,null,null,null,null,null,11,{"$f":"VLOOKUP($K14,'Shape Limits'!$S:$U,2,FALSE)","v":{"$error":"#N/A"}},{"$f":"VLOOKUP($K14,'Shape Limits'!$S:$U,3,FALSE)","v":{"$error":"#N/A"}},{"$f":"IF((VLOOKUP($K14,'Shape Limits'!$S:$V,4,FALSE))=1,\"Z\",\"\")","v":{"$error":"#N/A"}}]
[null,null,{"$f":"IF(AND(SHAPEW>0,SHAPELIMIT>0,EXT>1,PWSELECT=1),\"SIZE IS OUTSIDE LIMITATION\",IF(AND(SHAPEW>0,SHAPEH>0,MAX_IG=1),\"Must Have Tempered Glass\",IF(AND(SHAPEW>0,SHAPEH>0,MAX_IG=2),\"Glass is too large to produce\",\"\")))","v":""},null,null,null,null,null,null,null,12,{"$f":"VLOOKUP($K15,'Shape Limits'!$S:$U,2,FALSE)","v":{"$error":"#N/A"}},{"$f":"VLOOKUP($K15,'Shape Limits'!$S:$U,3,FALSE)","v":{"$error":"#N/A"}},{"$f":"IF((VLOOKUP($K15,'Shape Limits'!$S:$V,4,FALSE))=1,\"Z\",\"\")","v":{"$error":"#N/A"}}]
[null,null,{"$f":"IF(AND(RADIUS>\"\",PWSELECT=1),RADIUS,IF(ISERROR(GLASS),\"\",IF(AND(SHAPEW>0,GLASS=\"\"),\"Triple IG is not Available for this size\",\"\")))","v":""},null,null,null,null,null,null,null,13,{"$f":"VLOOKUP($K16,'Shape Limits'!$S:$U,2,FALSE)","v":{"$error":"#N/A"}},{"$f":"VLOOKUP($K16,'Shape Limits'!$S:$U,3,FALSE)","v":{"$error":"#N/A"}},{"$f":"IF((VLOOKUP($K16,'Shape Limits'!$S:$V,4,FALSE))=1,\"Z\",\"\")","v":{"$error":"#N/A"}}]
[null,null,null,null,null,null,null,null,null,null,14,{"$f":"VLOOKUP($K17,'Shape Limits'!$S:$U,2,FALSE)","v":{"$error":"#N/A"}},{"$f":"VLOOKUP($K17,'Shape Limits'!$S:$U,3,FALSE)","v":{"$error":"#N/A"}},{"$f":"IF((VLOOKUP($K17,'Shape Limits'!$S:$V,4,FALSE))=1,\"Z\",\"\")","v":{"$error":"#N/A"}}]
[null,null,"Absolute Min. Max. Sizes are based on Net Frame Size",null,null,null,null,null,null,null,15,{"$f":"VLOOKUP($K18,'Shape Limits'!$S:$U,2,FALSE)","v":{"$error":"#N/A"}},{"$f":"VLOOKUP($K18,'Shape Limits'!$S:$U,3,FALSE)","v":{"$error":"#N/A"}},{"$f":"IF((VLOOKUP($K18,'Shape Limits'!$S:$V,4,FALSE))=1,\"Z\",\"\")","v":{"$error":"#N/A"}}]

{"sheet":"Shape Limits","index":1,"n_rows":315,"n_cols":62,"rows_kept":315,"cut":false,"hidden":true,"merged":[[1,31,1,32],[2,36,2,37],[0,1,0,2],[0,3,0,10],[0,11,0,12],[1,29,1,30]]}
[null,{"$f":"MAX(D5,D12,D22,D31,D41,D49,D59,D71,D83,D91,D103,D114,D125,D134,D146,D158,D170,D182,D194,D206,D219,D228,D239,D251,D262,D274,D286)","v":0},null,"Shapes Min. Max. Limitations",null,null,null,null,null,null,null,{"$f":"IF(O1>\"\",O1,IF(O2>\"\",O2,IF(O3>\"\",O3,IF(O4>\"\",O4,IF(O5>\"\",O5,\"\")))))","v":""},null,null,{"$f":"IF($F$5>\"\",$F$5,IF($F$12>\"\",$F$12,IF($F$22>\"\",$F$22,IF($F$31>\"\",$F$31,IF($F$41>\"\",$F$41,IF($G$49>\"\",$G$49,\"\"))))))","v":""},null,null,{"$f":"IF(R2>0,R2,IF(R3>0,R3,IF(R4>0,R4,0)))","v":0},null,null,null,null,null,null,null,null,null,null,null,null,null,null,null,null,null,null,null,null,null,null,null,null,null,null,null,null,null,null,null,null,null,null,null,null,null,null,null,null,null,null,"Date","Notes:"]
[null,{"$f":"IF(SHAPESELECT=70,\"A77B\",IF(SHAPESELECT=80,\"A78B\",IF(SHAPESELECT=90,\"A79B\",\"A105\")))","v":"A77B"},"Min R","Max W","Max UI","Max Sq.ft",null,"Frame Height:",{"$f":"IF(AND(SHAPEW>0,SHAPE=B2),SHAPEW/2,0)","v":0},null,null,null,null,null,{"$f":"IF(F59>\"\",F59,IF(G71>\"\",G71,IF(F83>\"\",F83,IF(F91>\"\",F91,IF(F103>\"\",F103,IF(F114>\"\",F114,\"\"))))))","v":""},null,null,{"$f":"IF(I6>0,I6,IF(J14>0,J14,IF(I20>0,I20,IF(J29>0,J29,IF(J38>0,J38,IF(J46>0,J46,0))))))","v":0},null,null,null,null,null,null,null,null,null,null,"Description","Min",null,"Max",null,null,null,null,null,null,null,null,null,null,null,3,4,5,6,7,8,9,10,11,12,13,14,null,null,null,null,null,"2011-10-11","7356, 7818 and 7818 changed radius to 9.75 from 9"]
[null,{"$f":"EXT","v":1},{"$f":"MINRADIUS","v":0},{"$f":"MAX_W","v":0},{"$f":"MAX_UI","v":0},{"$f":"MAXSF","v":0},null,"Glass R:",{"$f":"IF(AND(SHAPEW>0,OFFSET>0,SHAPE=B2),I2-OFFSET,0)","v":0},null,null,null,null,null,{"$f":"IF(F125>\"\",F125,IF(G134>\"\",G134,IF(G146>\"\",G146,IF(G158>\"\",G158,IF(G170>\"\",G170,IF(G182>\"\",G182,\"\"))))))","v":""},null,null,{"$f":"IF(K56>0,K56,IF(J68>0,J68,IF(I84>0,I84,IF(J96>0,J96,IF(J97>0,J97,0)))))","v":0},null,null,null,null,null,null,null,null,1,"Select a Model",null,"W","H","W","H","UI",null,null,"Shapes",null,null,null,null,null,null,"EXT","OFFSET","CUTOFFSET","MIN_W","MIN_H","MAXSW","MAX_H","MAXSUI","MINLEG","MAXSF","MAXCUT","MINANGLE",null,null,null,null,null,"2012-08-10","7356, 7818 and 7818 changed radius to 9.75 from 9"]
[null,null,{"$f":"IF(AND(SHAPEW>0,SHAPE=B2,(SHAPEW/2)<C3),1,0)","v":0},{"$f":"IF(AND(SHAPEW>0,OFFSET>0,SHAPE=B2,SHAPEW>D3),1,0)","v":0},{"$f":"IF(AND(SHAPEW>0,OFFSET>0,SHAPE=B2,(SHAPEW+I2)>E3),1,0)","v":0},{"$f":"IF(AND(SHAPEW>0,OFFSET>0,SHAPE=B2,((I2*SHAPEW)/144)>F3),1,0)","v":0},null,"Glass H:",{"$f":"IF(AND(SHAPEW>0,SHAPE=B2),I2-(OFFSET*2),0)","v":0},null,null,null,null,null,{"$f":"IF(G194>\"\",G194,IF(F206>\"\",F206,IF(F219>\"\",F219,IF(F228>\"\",F228,IF(G239>\"\",G239,IF(F251>\"\",F251,\"\"))))))","v":""},null,null,{"$f":"IF(I211>0,I211,IF(I212>0,I212,IF(K259>0,K259,IF(K271>0,K271,0))))","v":0},null,null,null,null,null,null,null,null,2,"3A01 Comp.","Dbl Hung",12,"20",48,84,126,null,1,"Select","Select",null,1,"Select Extrusion",null,"Select Extrusion",1,0,0,0,0,0,0,0,0,0,0,0]
[null,null,{"$f":"MAX(C4:F4)","v":0},{"$f":"IF(AND(SHAPE=B2,C5=1),1,0)","v":0},{"$f":"IF(AND(SHAPEW>0,SHAPEH>0,SHAPE=B2,SHAPEH<>(SHAPEW/2)),1,0)","v":0},{"$f":"IF(AND(SHAPE=B2,E5=1),\"HEIGHT MUST BE 1/2 THE WIDTH\",IF(AND(SHAPE=B2,SHAPEW>0,C4>0),\"RADIUS MUST BE GREATER THAN \"&C3,IF(AND(SHAPE=B2,I5>0,I5<GlassMinW),\"Glass Width is Under Minimum\",IF(AND(SHAPE=B2,I4>0,I4<GlassMinH),\"Glass Height is Under Minimum\",\"\"))))","v":""},null,"Glass W:",{"$f":"IF(AND(SHAPEW>0,SHAPE=B2),2*(SQRT(I4*((2*((SHAPEW/2)-OFFSET))-I4))),0)","v":0},null,null,null,null,null,{"$f":"IF(F262>\"\",F262,IF(G274>\"\",G274,IF(F286>\"\",F286,\"\")))","v":""},null,null,{"$f":"$B$2","v":"A77B"},{"$f":"IF(SHAPE=$B$2,1,0)","v":0},{"$f":"IF(S5>0,\"Frame Width:\",0)","v":0},{"$f":"IF(S5>0,SHAPEW,0)","v":0},null,null,null,null,null,3,"3A01 Steel","Dbl Hung",12,"20","52",96,148,null,2,"A77A","A77A (Full Circle)",null,2,{"$f":"IF(SHAPESELECT=70,\"70 - Frame w/ 1-3/8\"\" NFS\",IF(OR(SHAPESELECT=80,SHAPESELECT=90),\"80/90 - Frame w/ 1-3/8\"\" NFS\",IF(SHAPESELECT=200,\"Mezzo\",\"\")))","v":"70 - Frame w/ 1-3/8\" NFS"},null,"Mezzo",3954,2.09375,2.605,null,null,null,null,null,6,56,7.4375,12]
[null,null,null,null,null,null,null,"Frame Radius:",{"$f":"IF(AND(SHAPEW>0,SHAPE=B2),SHAPEW/2,0)","v":0},null,null,null,null,null,null,null,null,"A77B",{"$f":"IF(SHAPE=$B$2,2,0)","v":0},{"$f":"IF(S6>0,\"Frame Height:\",0)","v":0},{"$f":"IF(S6>0,I2,0)","v":0},null,null,null,null,null,4,"3A02 Comp.","Dbl Slider",18.5,11.25,72,56,128,null,3,"A77B","A77B (Circle Top)",null,3,{"$f":"IF(SHAPESELECT=70,\"70 - Frame w/ 7/8\"\" NFS\",IF(OR(SHAPESELECT=80,SHAPESELECT=90),\"80/90 - Frame w/ 1\"\" NFS\",IF(SHAPESELECT=200,\"Mezzo w/ NF\",\"\")))","v":"70 - Frame w/ 7/8\" NFS"},null,"Mezzo w/ NF","3954F",2.09375,2.605,null,null,null,null,null,6,56,7.4375,12]
[null,null,null,null,null,null,null,null,null,null,null,null,null,null,null,null,null,"A77B",{"$f":"IF(SHAPE=$B$2,3,0)","v":0},{"$f":"IF(S7>0,\"Frame Radius:\",0)","v":0},{"$f":"IF(S7>0,I2,0)","v":0},{"$f":"IF(AND(S7>0,C4>0),1,0)","v":0},null,null,null,null,5,"3A02 Steel","Dbl Slider",18.5,11.25,96,"72",156,null,4,"A77C","A77C (Quarter Arch)",null,4,{"$f":"IF(SHAPESELECT=70,\"70 - Frame w/ J-Channel\",IF(OR(SHAPESELECT=80,SHAPESELECT=90),\"80/90 - Frame w/ Stucco\",IF(SHAPESELECT=200,\"Mezzo w/ Stucco\",\"\")))","v":"70 - Frame w/ J-Channel"},null,"Mezzo w/ Stucco","3954S",2.09375,2.605,null,null,null,null,null,6,56,7.4375,12]
[null,null,null,null,null,null,null,null,null,null,null,null,null,null,null,null,null,"A77B",{"$f":"IF(SHAPE=$B$2,4,0)","v":0},{"$f":"IF(S8>0,\"Glass Radius:\",0)","v":0},{"$f":"IF(S8>0,I3,0)","v":0},null,null,null,null,null,6,"3A03 Comp.","1/4-1/2-14 XOX",47.5,11.25,108,56,164,null,5,"A77D","A77D (Oval)",null,5,{"$f":"IF(SHAPESELECT=70,\"70 - Frame w/ Stucco\",IF(SHAPESELECT=200,\"Platinum\",\"\"))","v":"70 - Frame w/ Stucco"},null,"Platinum","PWFO1",1.125,1.5613999999999999,null,null,null,null,null,6,56,7.4375,8.8000000000000007]
[null,{"$f":"IF(SHAPESELECT=70,\"A77R\",IF(SHAPESELECT=80,\"A78R\",IF(SHAPESELECT=90,\"A79R\",\"A110\")))","v":"A77R"},"Min R","Max W","Max UI","Max H","Min Leg",null,"Frame Height:",{"$f":"IF(AND(SHAPEW>0,SHAPEH>0,SHAPE=B9),SHAPEH,0)","v":0},null,null,null,null,null,null,null,"A77B",{"$f":"IF(SHAPE=$B$2,5,0)","v":0},{"$f":"IF(S9>0,\"Glass Width:\",0)","v":0},{"$f":"IF(S9>0,I5,0)","v":0},{"$f":"IF(AND(U9>0,U9<GlassMinW),1,0)","v":0},null,null,null,null,7,"3A03 Steel","1/4-1/2-14 XOX",47.5,11.25,130,72,"192",null,6,"A77G","A77G (Octagon)",null,6,{"$f":"IF(SHAPESELECT=200,\"Platinum w/ Stucco\",\"\")","v":""},null,"Platinum w/ Stucco","PWFO1-S",1.125,3.0625,null,null,null,null,null,6,56,7.4375,8.8000000000000007]
[null,{"$f":"EXT","v":1},{"$f":"MINRADIUS","v":0},{"$f":"MAX_W","v":0},{"$f":"MAX_UI","v":0},{"$f":"MAX_H","v":0},6.25E-2,null,"Glass W:",{"$f":"IF(AND(SHAPEW>0,SHAPEH>0,OFFSET>0,SHAPE=B9),SHAPEW-(OFFSET*2),0)","v":0},null,null,null,null,null,null,null,"A77B",{"$f":"IF(SHAPE=$B$2,6,0)","v":0},{"$f":"IF(S10>0,\"Glass Height:\",0)","v":0},{"$f":"IF(S10>0,I4,0)","v":0},{"$f":"IF(AND(U10>0,U10<GlassMinH),1,0)","v":0},null,null,null,null,8,"3A04","PW",9.5,9.5,120,120,180,null,7,"A77H","A77H (Half Octagon)",null,1,{"$f":"VLOOKUP(EXTR,EXTLIST,2,FALSE)","v":"Select Extrusion"},null,"70 - Frame w/ 1-3/8\" NFS",7356,1.15625,1.748,null,null,null,null,null,6,56,7.4375,8.5]
[null,null,{"$f":"IF(AND(SHAPEW>0,SHAPE=B9,(SHAPEW/2)<C10),1,0)","v":0},{"$f":"IF(AND(SHAPEW>0,OFFSET>0,SHAPE=B9,SHAPEW>D10),1,0)","v":0},{"$f":"IF(AND(SHAPEW>0,OFFSET>0,SHAPE=B9,(SHAPEW+SHAPEH)>E10),1,0)","v":0},{"$f":"IF(AND(SHAPEW>0,OFFSET>0,SHAPE=B9,SHAPEH>F10),1,0)","v":0},{"$f":"IF(AND(SHAPEW>0,SHAPEH>0,SHAPE=B9,(SHAPEH-SHAPEW/2)<G10),1,0)","v":0},null,"Glass H:",{"$f":"IF(AND(SHAPEW>0,SHAPEH>0,OFFSET>0,SHAPE=B9),SHAPEH-(OFFSET*2),0)","v":0},null,null,null,null,null,null,null,"A77B",{"$f":"IF(SHAPE=$B$2,7,0)","v":0},{"$f":"IF(S11>0,\"Max Width:\",0)","v":0},{"$f":"IF(S11>0,D3,0)","v":0},{"$f":"IF(AND(S11>0,SHAPEW>0,SHAPEW>U11),1,0)","v":0},null,null,null,null,9,"3A09 Comp.","1/3-1/3-1/3 XOX",37.25,11.25,108,56,164,null,8,"A77J","A77J (1/4 Octagon)",null,null,null,null,"70 - Frame w/ 7/8\" NFS",7818,1.15625,1.748,null,null,null,null,null,6,56,7.4375,8.5]
[null,null,{"$f":"MAX(C11:G11)","v":0},{"$f":"IF(AND(SHAPE=B9,C12=1),1,0)","v":0},{"$f":"IF(AND(SHAPEW>0,OFFSET>0,DIM_4>0,SHAPEH>0,SHAPE=B9,(SHAPEH-DIM_4)<>(SHAPEW/2)),1,0)","v":0},{"$f":"IF(AND(SHAPE=B9,E12=1),\"HEIGHT MUST BE 1/2 THE WIDTH + DIM4\",IF(AND(SHAPE=B9,SHAPEW>0,C11>0),\"RADIUS MUST BE GREATER THAN \"&C10,IF(AND(SHAPE=B9,J10>0,J10<GlassMinW),\"Glass Width is Under Minimum\",IF(AND(SHAPE=B9,J11>0,J11<GlassMinH),\"Glass Height is Under Minimum\",\"\"))))","v":""},null,null,"Glass Leg H:",{"$f":"IF(AND(SHAPEW>0,SHAPEH>0,OFFSET>0,SHAPE=B9),(SHAPEH-SHAPEW/2)-OFFSET,0)","v":0},null,null,null,null,null,null,null,"A77B",{"$f":"IF(SHAPE=$B$2,8,0)","v":0},{"$f":"IF(S12>0,\"Max UI:\",0)","v":0},{"$f":"IF(S12>0,E3,0)","v":0},{"$f":"IF(AND(S12>0,F4>0),1,0)","v":0},null,null,null,null,10,"3A09 Steel","1/3-1/3-1/3 XOX",37.25,11.25,130,72,"192",null,9,"A77K","A77K (Eyebrow)",null,null,null,null,"70 - Frame w/ J-Channel",7358,1.15625,1.748,null,null,null,null,null,6,56,7.4375,8.5]
[null,null,null,null,null,null,null,null,"Glass R:",{"$f":"IF(AND(SHAPEW>0,SHAPEH>0,OFFSET>0,SHAPE=B9),(SHAPEW/2)-OFFSET,0)","v":0},null,null,null,null,null,null,null,{"$f":"$B$9","v":"A77R"},{"$f":"IF(SHAPE=$B$9,1,0)","v":0},{"$f":"IF(S13>0,\"Frame Width:\",0)","v":0},{"$f":"IF(S13>0,SHAPEW,0)","v":0},null,null,null,null,null,11,"03S0 Comp.","Sgl Hung",12,22,48,78,126,null,10,"A77L","A77L (Half Eyebrow)",null,null,null,null,"70 - Frame w/ Stucco",10000,1.15625,3.375,null,null,null,null,null,6,56,7.4375,8.5]
[null,null,null,null,null,null,null,null,"Frame Radius:",{"$f":"IF(AND(SHAPEW>0,SHAPEH>0,SHAPE=B9),SHAPEW/2,0)","v":0},null,null,null,null,null,null,null,"A77R",{"$f":"IF(SHAPE=$B$9,2,0)","v":0},{"$f":"IF(S14>0,\"Frame Height:\",0)","v":0},{"$f":"IF(S14>0,J9,0)","v":0},null,null,null,null,null,12,"03S0 Steel","Sgl Hung",12,22,52,96,148,null,11,"A77N","A77N (Isosceles Triangle)",null,null,null,null,"80/90 - Frame w/ 1-3/8\" NFS",8542,1.28125,1.873,null,null,null,null,null,6,56,7.4375,12]
[null,null,null,null,null,null,null,null,null,null,null,null,null,null,null,null,null,"A77R",{"$f":"IF(SHAPE=$B$9,3,0)","v":0},{"$f":"IF(S15>0,\"Frame Radius:\",0)","v":0},{"$f":"IF(S15>0,SHAPEW/2,0)","v":0},{"$f":"IF(AND(S15>0,C11>0),1,0)","v":0},null,null,null,null,13,"03S2 Comp.","Sgl Slider",18.5,12,72,56,128,null,12,"A77P","A77P (Right Triangle)",null,null,null,null,"80/90 - Frame w/ 1\" NFS",9934,1.28125,1.873,null,null,null,null,null,6,56,7.4375,12]
[null,null,null,null,null,null,null,null,null,null,null,null,null,null,null,null,null,"A77R",{"$f":"IF(SHAPE=$B$9,4,0)","v":0},{"$f":"IF(S16>0,\"Frame Leg:\",0)","v":0},{"$f":"IF(S16>0,SHAPEH-SHAPEW/2,0)","v":0},{"$f":"IF(AND(S20>0,G11>0),1,0)","v":0},null,null,null,null,14,"03S2 Steel","Sgl Slider",18.5,12,96,72,156,null,13,"A77Q","A77Q (Right Triangle W/Leg)",null,null,null,null,"80/90 - Frame w/ Stucco",8549,1.28125,3.5,null,null,null,null,null,6,56,7.4375,12]
[null,null,null,null,null,null,null,null,null,null,null,null,null,null,null,null,null,"A77R",{"$f":"IF(SHAPE=$B$9,5,0)","v":0},{"$f":"IF(S17>0,\"Glass Radius:\",0)","v":0},{"$f":"IF(S17>0,J13,0)","v":0},null,null,null,null,null,15,"03S3 Comp.","1/4-1/2-14 XOX",52,12,108,56,164,null,14,"A77R","A77R (Circle Top w/Ex Leg)",null,null,null,null,{"$f":"EXTSELECT","v":"Select Extrusion"},{"$f":"VLOOKUP(EXTSELECT,EXTCHART,2,FALSE)","v":1},{"$f":"VLOOKUP(EXTSELECT,EXTCHART,3,FALSE)","v":0},{"$f":"VLOOKUP(EXTSELECT,EXTCHART,4,FALSE)","v":0},{"$f":"IF(EXT=1,\"\",Data!$D$155)","v":""},{"$f":"IF(EXT=1,\"\",Data!$E$155)","v":""},{"$f":"IF(EXT=1,\"\",Data!$F$155)","v":""},{"$f":"IF(EXT=1,\"\",Data!$G$155)","v":""},{"$f":"IF(EXT=1,\"\",Data!$H$155)","v":""},{"$f":"VLOOKUP(EXTSELECT,EXTCHART,10,FALSE)","v":0},{"$f":"VLOOKUP(EXTSELECT,EXTCHART,11,FALSE)","v":0},{"$f":"VLOOKUP(EXTSELECT,EXTCHART,12,FALSE)","v":0},{"$f":"VLOOKUP(EXTSELECT,EXTCHART,13,FALSE)","v":0}]
[null,null,null,null,null,null,null,null,null,null,null,null,null,null,null,null,null,"A77R",{"$f":"IF(SHAPE=$B$9,6,0)","v":0},{"$f":"IF(S18>0,\"Glass Width:\",0)","v":0},{"$f":"IF(S18>0,J10,0)","v":0},{"$f":"IF(AND(U18>0,U18<GlassMinW),1,0)","v":0},null,null,null,null,16,"03S3 Steel","1/4-1/2-14 XOX",52,12,130,72,182,null,15,"A77S","A77S (Pentagon)",null,null,null,null,null,{"$f":"IF(OR(EXT=\"7356\",EXT=\"7818\",EXT=\"7358\"),1,0)","v":0}]
[null,{"$f":"IF(SHAPESELECT=70,\"A77C\",IF(SHAPESELECT=80,\"A78C\",IF(SHAPESELECT=90,\"A79C\",\"A111\")))","v":"A77C"},"Min W","Max W","Max UI","Max Sq.ft",null,"Frame Height:",{"$f":"IF(AND(SHAPEW>0,SHAPE=B19),SHAPEW,0)","v":0},null,null,null,null,null,null,null,null,"A77R",{"$f":"IF(SHAPE=$B$9,7,0)","v":0},{"$f":"IF(S19>0,\"Glass Height:\",0)","v":0},{"$f":"IF(S19>0,J11,0)","v":0},{"$f":"IF(AND(U19>0,U19<GlassMinH),1,0)","v":0},null,null,null,null,17,"03S4","PW",9.5,9.5,120,120,180,null,16,"A77U","A77U (Quarter Arch w/Ex Leg)"]
[null,{"$f":"EXT","v":1},{"$f":"IF(EXT=1,0,VLOOKUP(EXT,MINRADII,2,FALSE))","v":0},{"$f":"MAX_W","v":0},{"$f":"MAX_UI","v":0},{"$f":"MAXSF","v":0},null,"Frame R:",{"$f":"IF(AND(SHAPEW>0,SHAPE=B19),SHAPEW,0)","v":0},null,null,null,null,null,null,null,null,"A77R",{"$f":"IF(SHAPE=$B$9,8,0)","v":0},{"$f":"IF(S20>0,\"Glass Leg Height:\",0)","v":0},{"$f":"IF(S20>0,J12,0)","v":0},null,null,null,null,null,18,"03S9 Comp.","1/3-1/3-1/3 XOX",52,12,108,56,164,null,17,"A77V","A77V (Eyebrow w/Ex Leg)"]
[null,null,{"$f":"IF(AND(SHAPEW>0,SHAPE=B19,SHAPEW<C20),1,0)","v":0},{"$f":"IF(AND(SHAPEW>0,OFFSET>0,SHAPE=B19,SHAPEW>D20),1,0)","v":0},{"$f":"IF(AND(SHAPEW>0,OFFSET>0,SHAPE=B19,(SHAPEW+I19)>E20),1,0)","v":0},{"$f":"IF(AND(SHAPEW>0,OFFSET>0,SHAPEH>0,SHAPE=B19,((SHAPEH*SHAPEW)/144)>F20),1,0)","v":0},null,"Glass R:",{"$f":"IF(AND(SHAPEW>0,SHAPE=B19),SHAPEW-OFFSET,0)","v":0},null,null,null,null,null,null,null,null,"A77R",{"$f":"IF(SHAPE=$B$9,9,0)","v":0},{"$f":"IF(S21>0,\"Max Width:\",0)","v":0},{"$f":"IF(S21>0,D10,0)","v":0},{"$f":"IF(AND(S21>0,SHAPEW>0,SHAPEW>U21),1,0)","v":0},null,null,null,null,19,"03S9 Steel","1/3-1/3-1/3 XOX",52,12,130,72,192,null,18,"A77W","A77W (Half Eyebrow w/Ex Leg)",null,null,null,null,null,null,null,null,null,null,null,null,null,null,null,"SS (2.2)","DS (3.2)","4 mm","TS (5.0)"]
[null,null,{"$f":"MAX(C21:F21)","v":0},{"$f":"IF(AND(SHAPE=B19,C22=1),1,0)","v":0},{"$f":"IF(AND(SHAPEW>0,SHAPE=B19,SHAPEH>0,SHAPEH<>SHAPEW),1,0)","v":0},{"$f":"IF(AND(SHAPE=B19,E22=1),\"HEIGHT MUST BE EQUAL TO THE WIDTH\",IF(AND(SHAPE=B19,SHAPEW>0,C21>0),\"RADIUS MUST BE GREATER THAN \"&C20,IF(AND(SHAPE=B19,I22>0,I22<GlassMinW),\"Glass Width or Height is Under Minimum\",\"\")))","v":""},null,"Glass W & H:",{"$f":"IF(AND(SHAPEW>0,OFFSET>0,SHAPE=B19),SHAPEW-(OFFSET*2)-I25,0)","v":0},null,null,null,null,null,null,null,null,"A77R",{"$f":"IF(SHAPE=$B$9,10,0)","v":0},{"$f":"IF(S22>0,\"Max Height:\",0)","v":0},{"$f":"IF(S22>0,F10,0)","v":0},{"$f":"IF(AND(S22>0,SHAPEH>0,SHAPEH>U22),1,0)","v":0},null,null,null,null,20,"A270","PW","8.5","8.5",79,79,158,null,19,"A77Y","A77Y (Half Octagon w/Ex Leg)",null,null,null,null,"Glass Min. Max.",null,null,null,null,"Model","Width","Height","Area",null,"Max. Short",{"$f":"IF(OR($AW$104>41,$AW$113>41),0,41)","v":41},{"$f":"IF(OR($AW$104>56,$AW$113>56),0,56)","v":56},{"$f":"IF(OR($AW$104>67,$AW$113>67),0,67)","v":67},{"$f":"IF(OR($AW$104>70,$AW$113>70),0,70)","v":70},"Annealed"]
[null,null,null,null,null,null,null,"F",{"$f":"IF(AND(SHAPEW>0,OFFSET>0,SHAPE=B19),2*(ASIN((OFFSET*2)/(2*I21))),0)","v":0},null,null,null,null,null,null,null,null,"A77R",{"$f":"IF(SHAPE=$B$9,11,0)","v":0},{"$f":"IF(S23>0,\"Max UI:\",0)","v":0},{"$f":"IF(S23>0,E10,0)","v":0},{"$f":"IF(AND(S23>0,E11>0),1,0)","v":0},null,null,null,null,21,"A272","XO or OX",18,8.5,72,72,144,null,20,"A77Z","A77Z (1/4 Octagon w/Ex Leg)",null,null,null,null,"Glass Min Width",6,null,null,null,"A77A",{"$f":"$I$82","v":0},{"$f":"$I$83","v":0},{"$f":"(AW23*AX23)/144","v":0},null,"Max. Long",{"$f":"IF(OR($AX$104>62,$AX$113>62),0,62)","v":62},{"$f":"IF(OR($AX$104>76,$AX$113>76),0,76)","v":76},{"$f":"IF(OR($AX$104>90,$AX$113>90),0,90)","v":90},{"$f":"IF(OR($AX$104>102,$AX$113>102),0,102)","v":102},"Annealed"]
[null,null,null,null,null,null,null,"d",{"$f":"IF(AND(SHAPEW>0,SHAPE=B19),I21*COS(I23/2),0)","v":0},null,null,null,null,null,null,null,null,{"$f":"$B$19","v":"A77C"},{"$f":"IF(SHAPE=$B$19,1,0)","v":0},{"$f":"IF(S24>0,\"Frame Width:\",0)","v":0},{"$f":"IF(S24>0,SHAPEW,0)","v":0},null,null,null,null,null,22,"A273 (A)","XOX",47.5,14.5,"120","72","192",null,21,"A78A","A78A (Full Circle)",null,null,null,null,"Glass Min Height",6,null,null,null,"A77B",{"$f":"$I$5","v":0},{"$f":"$I$4","v":0},{"$f":"(AW24*AX24)/144","v":0},null,"Max Sq.Ft.",{"$f":"IF(OR($AY$104>12,$AY$113>12),0,12)","v":12},{"$f":"IF(OR($AY$104>22,$AY$113>22),0,22)","v":22},{"$f":"IF(OR($AY$104>28,$AY$113>28),0,28)","v":28},{"$f":"IF(OR($AY$104>35,$AY$113>35),0,35)","v":35},"Annealed"]
[null,null,null,null,null,null,null,"h",{"$f":"I21-I24","v":0},null,null,null,null,null,null,null,null,"A77C",{"$f":"IF(SHAPE=$B$19,2,0)","v":0},{"$f":"IF(S25>0,\"Frame Height:\",0)","v":0},{"$f":"IF(S25>0,I19,0)","v":0},null,null,null,null,null,23,"A273 (B)","XOX",71.5,9.5,"120","72","192",null,22,"A78B","A78B (Circle Top)",null,null,null,null,null,null,null,null,null,"A77C",{"$f":"$I$22","v":0},{"$f":"$I$22","v":0},0,null,"Max. Short",0,null,null,null,"Tempered"]
[null,null,null,null,null,null,null,null,null,null,null,null,null,null,null,null,null,"A77C",{"$f":"IF(SHAPE=$B$19,3,0)","v":0},{"$f":"IF(S26>0,\"Frame Radius:\",0)","v":0},{"$f":"IF(S26>0,I20,0)","v":0},{"$f":"IF(AND(S26>0,C21>0),1,0)","v":0},null,null,null,null,24,"A570","PW",8.5,8.5,79,79,158,null,23,"A78C","A78C (Quarter Arch)",null,null,null,null,"Minimum Radius",null,null,null,null,"A77D",{"$f":"$U$106","v":0},{"$f":"$U$107","v":0},0,null,"Max. Long",0,{"$f":"IF(OR($AW$104>84,$AW$113>84,$AX$104>84,$AX$113>84),0,84)","v":84},0,{"$f":"IF(OR($AW$104>140,$AW$113>140,$AX$104>140,$AX$113>140),0,140)","v":140},"Tempered"]
[null,null,null,null,null,null,null,null,null,null,null,null,null,null,null,null,null,"A77C",{"$f":"IF(SHAPE=$B$19,4,0)","v":0},{"$f":"IF(S27>0,\"Glass Radius:\",0)","v":0},{"$f":"IF(S27>0,I21,0)","v":0},null,null,null,null,null,25,"A571 (A)","SH",14.5,23.5,48,96,144,null,24,"A78D","A78D (Oval)",null,null,null,"Mezzo",3954,{"$f":"IF(OR(SHAPE=\"A117\",SHAPE=\"A119\"),13,12.5)","v":12.5},null,null,null,"A77G",{"$f":"$I$124","v":0},{"$f":"$I$123","v":0},0,null,"Max Sq.Ft.",0,{"$f":"IF(OR($AY$104>20,$AY$113>20),0,20)","v":20},0,{"$f":"IF(OR($AY$104>27,$AY$113>27),0,27)","v":27},"Tempered"]
[null,{"$f":"IF(SHAPESELECT=70,\"A77U\",IF(SHAPESELECT=80,\"A78U\",IF(SHAPESELECT=90,\"A79U\",\"A112\")))","v":"A77U"},"Min W","Max W","Max UI","Max H","Min Leg",null,"Frame Height:",{"$f":"IF(AND(SHAPEW>0,SHAPE=B28,SHAPEH>0),SHAPEH,0)","v":0},null,null,null,null,null,null,null,"A77C",{"$f":"IF(SHAPE=$B$19,5,0)","v":0},{"$f":"IF(S28>0,\"Glass Width:\",0)","v":0},{"$f":"IF(S28>0,I22,0)","v":0},{"$f":"IF(AND(U28>0,U28<GlassMinW),1,0)","v":0},null,null,null,null,26,"A571 (B)","SH",10,29.5,48,96,144,null,25,"A78G","A78G (Octagon)",null,null,null,"70 - Frame w/ 1-3/8\" NFS",7356,{"$f":"IF(SF=TRUE,11.75,9.75)","v":9.75},null,null,null,"A77H",{"$f":"$K$105","v":0},{"$f":"$K$106","v":0},0,null,null,{"$f":"IF(AND(BB22>0,BB23>0,BB24>0),1,0)","v":1},{"$f":"IF(AND(BC22>0,BC23>0,BC24>0),1,0)","v":1},{"$f":"IF(AND(BD22>0,BD23>0,BD24>0),1,0)","v":1},{"$f":"IF(AND(BE22>0,BE23>0,BE24>0),1,0)","v":1},{"$f":"IF(BB28>0,\"≥SS Annealed\",IF(BC28>0,\"≥DS Annealed\",IF(BE28>0,\"TS Annealed\",\"\")))","v":"≥SS Annealed"}]
[null,{"$f":"EXT","v":1},{"$f":"IF(EXT=1,0,VLOOKUP(EXT,MINRADII,2,FALSE))","v":0},{"$f":"MAX_W","v":0},{"$f":"MAX_UI","v":0},{"$f":"MAX_H","v":0},6.25E-2,null,"Frame R:",{"$f":"IF(AND(SHAPEW>0,SHAPE=B28),SHAPEW,0)","v":0},null,null,null,null,null,null,null,"A77C",{"$f":"IF(SHAPE=$B$19,6,0)","v":0},{"$f":"IF(S29>0,\"Glass Height:\",0)","v":0},{"$f":"IF(S29>0,I22,0)","v":0},{"$f":"IF(AND(U29>0,U29<GlassMinH),1,0)","v":0},null,null,null,null,27,"A770","PW",8.5,8.5,120,120,180,null,26,"A78H","A78H (Half Octagon)",null,null,null,"70 - Frame w/ 7/8\" NFS",7818,{"$f":"IF(SF=TRUE,11.75,9.75)","v":9.75},null,null,null,"A77J",{"$f":"$K$116","v":0},{"$f":"$K$117","v":0},0,null,null,null,{"$f":"IF(AND(BC26>0,BC27>0),1,0)","v":1},{"$f":"IF(AND(BD26>0,BD27>0),1,0)","v":0},{"$f":"IF(AND(BE26>0,BE27>0),1,0)","v":1},{"$f":"IF(BC29>0,\"≥DS Tempered\",IF(AND(BE29>0,TIGWEIGHT<150),\"≥TS Tempered\",IF(AND(BE29>0,TIGWEIGHT>150,SHAPEW>SHAPEH),\"≥TS Tempered\",\"\")))","v":"≥DS Tempered"}]
[null,null,{"$f":"IF(AND(SHAPEW>0,SHAPE=B28,SHAPEW<C29),1,0)","v":0},{"$f":"IF(AND(SHAPEW>0,OFFSET>0,SHAPE=B28,SHAPEW>D29),1,0)","v":0},{"$f":"IF(AND(SHAPEW>0,OFFSET>0,SHAPE=B28,(SHAPEW+SHAPEH)>E29),1,0)","v":0},{"$f":"IF(AND(SHAPEW>0,OFFSET>0,SHAPE=B28,SHAPEH>F29),1,0)","v":0},{"$f":"IF(AND(SHAPEW>0,SHAPE=B28,(SHAPEH-SHAPEW)<G29),1,0)","v":0},null,"Glass R:",{"$f":"IF(AND(SHAPEW>0,SHAPE=B28),SHAPEW-OFFSET,0)","v":0},null,null,null,null,null,null,null,"A77C",{"$f":"IF(SHAPE=$B$19,7,0)","v":0},{"$f":"IF(S30>0,\"Max Width:\",0)","v":0},{"$f":"IF(S30>0,D20,0)","v":0},{"$f":"IF(AND(S30>0,SHAPEW>0,SHAPEW>U30),1,0)","v":0},null,null,null,null,28,"A280","PW",10.5,10.5,120,120,180,null,27,"A78J","A78J (1/4 Octagon)",null,null,null,"70 - Frame w/ J-Channel",7358,{"$f":"IF(SF=TRUE,11.75,9.75)","v":9.75},null,null,null,"A77K",{"$f":"$J$41","v":0},{"$f":"$J$40","v":0},0,null,null,"2.5 mm","3.2 mm","4 mm","5 mm"]
[null,null,{"$f":"MAX(C30:G30)","v":0},{"$f":"IF(AND(SHAPE=B28,C31=1),1,0)","v":0},{"$f":"IF(AND(SHAPEW>0,SHAPEH>0,DIM_4>0,SHAPE=B28,SHAPEH<>(SHAPEW+DIM_4)),1,0)","v":0},{"$f":"IF(AND(SHAPE=B28,E31=1),\"HEIGHT MUST BE EQUAL TO THE WIDTH + DIM4\",IF(AND(SHAPE=B28,SHAPEW>0,C30>0),\"RADIUS MUST BE GREATER THAN \"&C29,IF(AND(SHAPE=B28,J31>0,J31<GlassMinW),\"Glass Width is Under Minimum\",IF(AND(SHAPE=B28,J32>0,J32<GlassMinH),\"Glass Height is Under Minimum\",\"\"))))","v":""},null,null,"Glass W:",{"$f":"IF(AND(SHAPEW>0,OFFSET>0,SHAPE=B28),SHAPEW-(OFFSET*2),0)","v":0},null,null,null,null,null,null,null,"A77C",{"$f":"IF(SHAPE=$B$19,8,0)","v":0},{"$f":"IF(S31>0,\"Max UI:\",0)","v":0},{"$f":"IF(S31>0,E20,0)","v":0},{"$f":"IF(AND(S31>0,E21>0),1,0)","v":0},null,null,null,null,29,"A282 (A)","XO or OX",20,14.5,96,"72",168,null,28,"A78K","A78K (Eyebrow)",null,null,null,"70 - Frame w/ Stucco",10000,11.75,null,null,null,"A77L",{"$f":"$K$59","v":0},{"$f":"$K$58","v":0},0,null,"Max. Short",{"$f":"IF(OR($AX$104>41,$AX$113>41),0,41)","v":41},{"$f":"IF(OR($AX$104>56,$AX$113>56),0,56)","v":56},{"$f":"IF(OR($AX$104>67,$AX$113>67),0,67)","v":67},{"$f":"IF(OR($AX$104>70,$AX$113>70),0,70)","v":70},"Annealed"]
[null,null,null,null,null,null,null,null,"Glass H:",{"$f":"IF(AND(SHAPEW>0,OFFSET>0,SHAPE=B28,SHAPEH>0),SHAPEH-(OFFSET*2)-J36,0)","v":0},null,null,null,null,null,null,null,{"$f":"$B$28","v":"A77U"},{"$f":"IF(SHAPE=$B$28,1,0)","v":0},{"$f":"IF(S32>0,\"Frame Width:\",0)","v":0},{"$f":"IF(S32>0,SHAPEW,0)","v":0},null,null,null,null,null,30,"A282 (B)","XO or OX",29.5,10.5,96,"72",168,null,29,"A78L","A78L (Half Eyebrow)",null,null,null,"80/90 - Frame w/ 1-3/8\" NFS",8542,11.75,null,null,null,"A77N",{"$f":"$K$193","v":0},{"$f":"$K$194","v":0},0,null,"Max. Long",{"$f":"IF(OR($AW$104>62,$AW$113>62),0,62)","v":62},{"$f":"IF(OR($AW$104>76,$AW$113>76),0,76)","v":76},{"$f":"IF(OR($AW$104>90,$AW$113>90),0,90)","v":90},{"$f":"IF(OR($AW$104>102,$AW$113>102),0,102)","v":102},"Annealed"]
[null,null,null,null,null,null,null,null,"Glass Leg H:",{"$f":"IF(AND(SHAPEW>0,SHAPEH>0,SHAPE=B28,OFFSET>0),(SHAPEH-SHAPEW)-OFFSET,0)","v":0},null,null,null,null,null,null,null,"A77U",{"$f":"IF(SHAPE=$B$28,2,0)","v":0},{"$f":"IF(S33>0,\"Frame Height:\",0)","v":0},{"$f":"IF(S33>0,J28,0)","v":0},null,null,null,null,null,31,"A283","XOX",40,10.5,120,72,192,null,30,"A78N","A78N (Isosceles Triangle)",null,null,null,"80/90 - Frame w/ 1\" NFS",9934,11.75,null,null,null,"A77P",{"$f":"$J$182","v":0},{"$f":"$J$183","v":0},0,null,"Max Sq.Ft.",{"$f":"IF(OR($AY$104>12,$AY$113>12),0,12)","v":12},{"$f":"IF(OR($AY$104>22,$AY$113>22),0,22)","v":22},{"$f":"IF(OR($AY$104>28,$AY$113>28),0,28)","v":28},{"$f":"IF(OR($AY$104>35,$AY$113>35),0,35)","v":35},"Annealed"]
[null,null,null,null,null,null,null,null,"F",{"$f":"IF(AND(SHAPEW>0,OFFSET>0,SHAPE=B28),2*(ASIN((OFFSET*2)/(2*J30))),0)","v":0},null,null,null,null,null,null,null,"A77U",{"$f":"IF(SHAPE=$B$28,3,0)","v":0},{"$f":"IF(S34>0,\"Frame Radius:\",0)","v":0},{"$f":"IF(S34>0,J29,0)","v":0},{"$f":"IF(AND(S34>0,C30>0),1,0)","v":0},null,null,null,null,32,"A580","PW",10.5,10.5,120,120,180,null,31,"A78P","A78P (Right Triangle)",null,null,null,"80/90 - Frame w/ Stucco",8549,11.75,null,null,null,"A77Q",{"$f":"$J$172","v":0},{"$f":"$J$173","v":0},0,null,"Max. Short",0,null,null,null,"Tempered"]
[null,null,null,null,null,null,null,null,"d",{"$f":"IF(AND(SHAPEW>0,SHAPE=B28),J30*COS(J34/2),0)","v":0},null,null,null,null,null,null,null,"A77U",{"$f":"IF(SHAPE=$B$28,4,0)","v":0},{"$f":"IF(S35>0,\"Frame Leg:\",0)","v":0},{"$f":"IF(AND(S35>0,SHAPEH>0,SHAPEW>0),SHAPEH-SHAPEW,0)","v":0},{"$f":"IF(AND(S35>0,G30>0),1,0)","v":0},null,null,null,null,33,"A581 (A)","SH",15,24,54,96,144,null,32,"A78Q","A78Q (Right Triangle W/Leg)",null,null,null,"Mezzo w/ NF","3954F",13,null,null,null,"A77R",{"$f":"$J$10","v":0},{"$f":"$J$11","v":0},0,null,"Max. Long",0,{"$f":"IF(OR($AW$104>84,$AW$113>84,$AX$104>84,$AX$113>84),0,84)","v":84},0,{"$f":"IF(OR($AW$104>140,$AW$113>140,$AX$104>140,$AX$113>140),0,140)","v":140},"Tempered"]
[null,null,null,null,null,null,null,null,"h",{"$f":"J30-J35","v":0},null,null,null,null,null,null,null,"A77U",{"$f":"IF(SHAPE=$B$28,5,0)","v":0},{"$f":"IF(S36>0,\"Glass Radius:\",0)","v":0},{"$f":"IF(S36>0,J30,0)","v":0},null,null,null,null,null,34,"A581 (B)","SH",10.5,30,54,96,144,null,33,"A78R","A78R (Circle Top w/Ex Leg)",null,null,null,"Mezzo w/ Stucco","3954S",13.5,null,null,null,"A77S",{"$f":"$J$162","v":0},{"$f":"$J$159","v":0},0,null,"Max Sq.Ft.",0,{"$f":"IF(OR($AY$104>20,$AY$113>20),0,20)","v":20},0,{"$f":"IF(OR($AY$104>27,$AY$113>27),0,27)","v":27},"Tempered"]
[null,null,null,null,null,null,null,null,null,null,null,null,null,null,null,null,null,"A77U",{"$f":"IF(SHAPE=$B$28,6,0)","v":0},{"$f":"IF(S37>0,\"Glass Width:\",0)","v":0},{"$f":"IF(S37>0,J31,0)","v":0},{"$f":"IF(AND(U37>0,U37<GlassMinW),1,0)","v":0},null,null,null,null,35,"A780","PW","10","10",120,120,"180",null,34,"A78S","A78S (Pentagon)",null,null,null,"Platinum","PWFO1",10,null,null,null,"A77U",{"$f":"$J$31","v":0},{"$f":"$J$32","v":0},0,null,null,{"$f":"IF(AND(BB31>0,BB32>0,BB33>0),1,0)","v":1},{"$f":"IF(AND(BC31>0,BC32>0,BC33>0),1,0)","v":1},{"$f":"IF(AND(BD31>0,BD32>0,BD33>0),1,0)","v":1},{"$f":"IF(AND(BE31>0,BE32>0,BE33>0),1,0)","v":1},{"$f":"IF(BB37>0,\"≥SS Annealed\",IF(BC37>0,\"≥DS Annealed\",IF(BE37>0,\"TS Annealed\",\"\")))","v":"≥SS Annealed"}]
[null,{"$f":"IF(SHAPESELECT=70,\"A77K\",IF(SHAPESELECT=80,\"A78K\",IF(SHAPESELECT=90,\"A79K\",\"A113\")))","v":"A77K"},"Min R","Max W","Max UI","Max Sq.ft","Cut L","Min H","Frame Radius",{"$f":"IF(AND(SHAPEW>0,SHAPEH>0,SHAPE=B38),((SHAPEW/2)^2+SHAPEH^2)/(2*SHAPEH),0)","v":0},null,null,null,null,null,null,null,"A77U",{"$f":"IF(SHAPE=$B$28,7,0)","v":0},{"$f":"IF(S38>0,\"Glass Height:\",0)","v":0},{"$f":"IF(S38>0,J32,0)","v":0},{"$f":"IF(AND(U38>0,U38<GlassMinH),1,0)","v":0},null,null,null,null,36,"A390","PW",10.5,10.5,120,120,180,null,35,"A78U","A78U (Quarter Arch w/Ex Leg)",null,null,null,"Platinum w/ Stucco","PWFO1-S",11.75,null,null,null,"A77V",{"$f":"$J$49","v":0},{"$f":"$J$48","v":0},0,null,null,null,{"$f":"IF(AND(BC35>0,BC36>0),1,0)","v":1},{"$f":"IF(AND(BD35>0,BD36>0),1,0)","v":0},{"$f":"IF(AND(BE35>0,BE36>0),1,0)","v":1},{"$f":"IF(BC38>0,\"≥DS Tempered\",IF(AND(BE38>0,TIGWEIGHT<150),\"≥TS Tempered\",IF(AND(BE38>0,TIGWEIGHT>150,SHAPEW>SHAPEH),\"≥TS Tempered\",\"\")))","v":"≥DS Tempered"}]
[null,{"$f":"EXT","v":1},{"$f":"MINRADIUS","v":0},{"$f":"MAX_W","v":0},{"$f":"MAX_UI","v":0},{"$f":"MAXSF","v":0},{"$f":"MAXCUT","v":0},{"$f":"MIN_H","v":0},"Glass Radius",{"$f":"IF(AND(SHAPEW>0,SHAPEH>0,OFFSET>0,SHAPE=B38),J38-OFFSET,0)","v":0},{"$f":"IF(AND(SHAPEW>0,SHAPEH>0,OFFSET>0,SHAPE=B38),J38-CUTOFFSET,0)","v":0},null,null,null,null,null,null,"A77U",{"$f":"IF(SHAPE=$B$28,8,0)","v":0},{"$f":"IF(S39>0,\"Glass Leg Height:\",0)","v":0},{"$f":"IF(S39>0,J33,0)","v":0},null,null,null,null,null,37,"A392 (A)","XO or OX",20,14.5,96,"72",168,null,36,"A78V","A78V (Eyebrow w/Ex Leg)",null,null,null,null,null,null,null,null,null,"A77W",{"$f":"$J$71","v":0},{"$f":"$J$70","v":0},0]
[null,null,{"$f":"IF(AND(SHAPEW>0,SHAPEH>0,SHAPE=B38,J38<C39),1,0)","v":0},{"$f":"IF(AND(SHAPEW>0,OFFSET>0,SHAPE=B38,SHAPEW>D39),1,0)","v":0},{"$f":"IF(AND(SHAPEW>0,OFFSET>0,SHAPEH>0,SHAPE=B38,(SHAPEW+SHAPEH)>E39),1,0)","v":0},{"$f":"IF(AND(SHAPEW>0,OFFSET>0,SHAPEH>0,SHAPE=B38,((SHAPEW*SHAPEH)/144)>F39),1,0)","v":0},{"$f":"IF(AND(SHAPEW>0,SHAPE=B38,SHAPEH>0,J43>G39),1,0)","v":0},{"$f":"IF(AND(SHAPEW>0,SHAPEH>0,SHAPE=B38,SHAPEH<H39),1,0)","v":0},"Glass Height",{"$f":"IF(AND(SHAPEW>0,SHAPEH>0,OFFSET>0,SHAPE=B38),SHAPEH-(2*OFFSET),0)","v":0},{"$f":"IF(AND(SHAPEW>0,SHAPEH>0,OFFSET>0,SHAPE=B38),SHAPEH-(2*CUTOFFSET),0)","v":0},null,null,null,null,null,null,"A77U",{"$f":"IF(SHAPE=$B$28,9,0)","v":0},{"$f":"IF(S40>0,\"Max Width:\",0)","v":0},{"$f":"IF(S40>0,D29,0)","v":0},{"$f":"IF(AND(S40>0,SHAPEW>0,SHAPEW>U40),1,0)","v":0},null,null,null,null,38,"A392 (B)","XO or OX",29.5,10.5,96,"72",168,null,37,"A78W","A78W (Half Eyebrow w/Ex Leg)",null,null,null,null,null,false,null,null,null,"A77Y",{"$f":"$J$139","v":0},{"$f":"$J$140","v":0},0]
[null,null,{"$f":"MAX(C40:H40)","v":0},{"$f":"IF(AND(SHAPE=B38,C41=1),1,0)","v":0},{"$f":"IF(AND(SHAPEW>0,SHAPEH>0,SHAPE=B38,SHAPEH>=(SHAPEW/2)),1,0)","v":0},{"$f":"IF(AND(SHAPE=B38,E41=1),\"FRAME HEIGHT MUST BE LESS THAN 1/2 THE WIDTH\",IF(AND(SHAPE=B38,SHAPEW>0,C40>0),\"RADIUS MUST BE GREATER THAN \"&C39,IF(AND(SHAPE=B38,J41>0,J41<GlassMinW),\"Glass Width is Under Minimum\",IF(AND(SHAPE=B38,J40>0,J40<GlassMinH),\"Glass Height is Under Minimum\",\"\"))))","v":""},null,null,"Glass Width",{"$f":"IF(AND(SHAPEW>0,SHAPEH>0,OFFSET>0,SHAPE=B38),2*(SQRT(J40*((2*J39)-J40))),0)","v":0},{"$f":"IF(AND(SHAPEW>0,SHAPEH>0,OFFSET>0,SHAPE=B38),2*(SQRT(K40*((2*K39)-K40))),0)","v":0},null,null,null,null,null,null,"A77U",{"$f":"IF(SHAPE=$B$28,10,0)","v":0},{"$f":"IF(S41>0,\"Max Height:\",0)","v":0},{"$f":"IF(S41>0,F29,0)","v":0},{"$f":"IF(AND(S41>0,SHAPEH>0,SHAPEH>U41),1,0)","v":0},null,null,null,null,39,"A393","XOX",40,10.5,"120","72","192",null,38,"A78Y","A78Y (Half Octagon w/Ex Leg)",null,null,null,null,null,{"$f":"IF(AND(SHAPEW>0,EXT>1),VLOOKUP(EXT,MINRADII,2,FALSE),0)","v":0},null,null,null,"A77Z",{"$f":"$J$151","v":0},{"$f":"$J$152","v":0},0,null,"Glass Option"]
[null,null,null,null,null,null,null,null,"Angle of cut",{"$f":"IF(AND(SHAPEW>0,SHAPEH>0,OFFSET>0,SHAPE=B38),DEGREES(ATAN(CUTOFFSET/((SHAPEW-K41)/2))),0)","v":0},null,null,null,null,null,null,null,"A77U",{"$f":"IF(SHAPE=$B$28,11,0)","v":0},{"$f":"IF(S42>0,\"Max UI:\",0)","v":0},{"$f":"IF(S42>0,E29,0)","v":0},{"$f":"IF(AND(S42>0,E30>0),1,0)","v":0},null,null,null,null,40,"A990","PW","10.5","10.5",120,120,"180",null,39,"A78Z","A78Z (1/4 Octagon w/Ex Leg)",null,null,null,null,null,null,null,null,null,"A78A",{"$f":"$I$82","v":0},{"$f":"$I$83","v":0},0,null,{"$f":"IF(BF28>\"\",BF28,IF(BF37>\"\",BF37,\"\"))","v":"≥SS Annealed"}]
[null,null,null,null,null,null,null,null,"Cut Length",{"$f":"IF(AND(SHAPEW>0,SHAPEH>0,OFFSET>0,SHAPE=B38),SQRT(CUTOFFSET^2+((SHAPEW-K41)/2)^2),0)","v":0},null,null,null,null,null,null,null,{"$f":"$B$38","v":"A77K"},{"$f":"IF(SHAPE=$B$38,1,0)","v":0},{"$f":"IF(S43>0,\"Frame Radius:\",0)","v":0},{"$f":"IF(S43>0,J38,0)","v":0},{"$f":"IF(AND(S43>0,C40>0),1,0)","v":0},null,null,null,null,41,"A991 (A)","SH",15,24,54,96,144,null,40,"A79A","A79A (Full Circle)",null,null,null,null,null,null,null,null,null,"A78B",{"$f":"$I$5","v":0},{"$f":"$I$4","v":0},0,null,{"$f":"IF(BF29>\"\",BF29,IF(BF38>\"\",BF38,\"\"))","v":"≥DS Tempered"}]
[null,null,null,null,null,null,null,null,"Arc Length",{"$f":"IF(AND(SHAPEW>0,SHAPEH>0,OFFSET>0,SHAPE=B38),J38*(2*(ASIN(SHAPEW/(2*J38)))),0)","v":0},null,null,null,null,null,null,null,"A77K",{"$f":"IF(SHAPE=$B$38,2,0)","v":0},{"$f":"IF(S44>0,\"Glass Radius:\",0)","v":0},{"$f":"IF(S44>0,J39,0)","v":0},null,null,null,null,null,42,"A991 (B)","SH",10.5,30,54,96,144,null,41,"A79B","A79B (Circle Top)",null,null,null,null,"Models require width only",null,null,null,null,"A78C",{"$f":"$I$22","v":0},{"$f":"$I$22","v":0},0,null,{"$f":"IF(OR(BF28=\"≥SS Annealed\",BF28=\"≥DS Annealed\",BF29=\"≥DS Tempered\",BF37=\"≥SS Annealed\",BF37=\"≥DS Annealed\",BF38=\"≥DS Tempered\"),\"TIG\",IF(OR(AND(PW=\"A680 Vent Wrap\",BF28=\"≥TS Annealed\"),AND(PW=\"A680 Vent Wrap\",BF29=\"≥TS Tempered\"),AND(PW=\"A680 Vent Wrap\",BF37=\"≥TS Annealed\"),AND(PW=\"A680 Vent Wrap\",BF38=\"≥TS Tempered\")),\"TIG\",\"\"))","v":"TIG"}]
[null,null,null,null,null,null,null,null,null,null,null,null,null,null,null,null,null,"A77K",{"$f":"IF(SHAPE=$B$38,3,0)","v":0},{"$f":"IF(S45>0,\"Glass Width:\",0)","v":0},{"$f":"IF(S45>0,J41,0)","v":0},{"$f":"IF(AND(U45>0,U45<GlassMinW),1,0)","v":0},null,null,null,null,43,"A890","PW",10,10,120,120,180,null,42,"A79C","A79C (Quarter Arch)",null,null,null,"Select",1,null,null,null,null,"A78D",{"$f":"$U$106","v":0},{"$f":"$U$107","v":0},0,null,{"$f":"IF(OR(AND(GLASS_W>70,GLASS_H>102),AND(GLASS_W>102,GLASS_H>70),AND(GLASS_SQFT>35,GLASS_SQFT<50)),1,IF(OR(AND(GLASS_W>140,GLASS_H>140),GLASS_SQFT>50),2,0))","v":0}]
[null,{"$f":"IF(SHAPESELECT=70,\"A77V\",IF(SHAPESELECT=80,\"A78V\",IF(SHAPESELECT=90,\"A79V\",\"A114\")))","v":"A77V"},"Min R","Max W","Max H","Max UI","Min Leg","Cut L","Frame Radius",{"$f":"IF(AND(SHAPEW>0,SHAPEH>0,DIM_4>0,SHAPE=B46),((SHAPEW/2)^2+(SHAPEH-DIM_4)^2)/(2*(SHAPEH-DIM_4)),0)","v":0},null,null,null,null,null,null,null,"A77K",{"$f":"IF(SHAPE=$B$38,4,0)","v":0},{"$f":"IF(S46>0,\"Glass Height:\",0)","v":0},{"$f":"IF(S46>0,J40,0)","v":0},{"$f":"IF(AND(U46>0,U46<GlassMinH),1,0)","v":0},null,null,null,null,44,"A680","PW","11.5","11.5",120,120,180,null,43,"A79D","A79D (Oval)",null,null,null,"A77A",1,null,null,null,null,"A78G",{"$f":"$I$124","v":0},{"$f":"$I$123","v":0},0]
[null,{"$f":"EXT","v":1},{"$f":"MINRADIUS","v":0},{"$f":"MAX_W","v":0},{"$f":"MAX_H","v":0},{"$f":"MAX_UI","v":0},{"$f":"MINLEG","v":0},{"$f":"MAXCUT","v":0},"Glass Radius",{"$f":"IF(AND(SHAPEW>0,SHAPEH>0,DIM_4>0,OFFSET>0,SHAPE=B46),J46-OFFSET,0)","v":0},{"$f":"IF(AND(SHAPEW>0,SHAPEH>0,DIM_4>0,OFFSET>0,SHAPE=B46),J46-CUTOFFSET,0)","v":0},null,null,null,null,null,null,"A77K",{"$f":"IF(SHAPE=$B$38,5,0)","v":0},{"$f":"IF(S47>0,\"Angle of Cut:\",0)","v":0},{"$f":"IF(S47>0,J42,0)","v":0},null,null,null,null,null,45,"A681 (A)","Awning",16,18,48,48,96,null,44,"A79G","A79G (Octagon)",null,null,null,"A77B",1,null,null,null,null,"A78H",{"$f":"$K$105","v":0},{"$f":"$K$106","v":0},0]
[null,null,{"$f":"IF(AND(SHAPEW>0,SHAPEH>0,SHAPE=B46,J46<C47),1,0)","v":0},{"$f":"IF(AND(SHAPEW>0,OFFSET>0,SHAPEH>0,SHAPE=B46,OR(SHAPEW>D47,SHAPEH>D47)),1,0)","v":0},{"$f":"IF(AND(SHAPEW>0,OFFSET>0,SHAPEH>0,SHAPE=B46,OR(SHAPEW>E47,SHAPEH>E47)),1,0)","v":0},{"$f":"IF(AND(SHAPEW>0,OFFSET>0,SHAPEH>0,SHAPE=B46,DIM_4>0,(SHAPEW+SHAPEH)>F47),1,0)","v":0},{"$f":"IF(AND(SHAPEW>0,SHAPEH>0,SHAPE=B46,DIM_4>0,DIM_4<G47),1,0)","v":0},{"$f":"IF(AND(SHAPEW>0,SHAPE=B46,SHAPEH>0,OR(J51>H47,J52>H47)),1,0)","v":0},"Glass Height",{"$f":"IF(AND(SHAPEW>0,SHAPEH>0,DIM_4>0,OFFSET>0,SHAPE=B46),SHAPEH-(2*OFFSET),0)","v":0},{"$f":"IF(AND(SHAPEW>0,SHAPEH>0,DIM_4>0,OFFSET>0,SHAPE=B46),SHAPEH-(2*CUTOFFSET),0)","v":0},null,null,null,null,null,null,"A77K",{"$f":"IF(SHAPE=$B$38,6,0)","v":0},{"$f":"IF(S48>0,\"Cut Length:\",0)","v":0},{"$f":"IF(S48>0,J43,0)","v":0},{"$f":"IF(AND(S48>0,G40>0),1,0)","v":0},null,null,null,null,46,"A681 (B)","Awning",20,11.5,48,48,96,null,45,"A79H","A79H (Half Octagon)",null,null,null,"A77C",1,null,null,null,null,"A78J",{"$f":"$K$116","v":0},{"$f":"$K$117","v":0},0]
[null,null,{"$f":"MAX(C48:H48)","v":0},{"$f":"IF(AND(SHAPE=B46,C49=1),1,0)","v":0},null,{"$f":"IF(AND(SHAPEW>0,SHAPEH>0,SHAPE=B46,(SHAPEH-DIM_4)>=(SHAPEW/2)),1,0)","v":0},{"$f":"IF(AND(SHAPE=B46,F49=1),\"FRAME HEIGHT MINUS LEG MUST BE LESS THAN 1/2 THE WIDTH\",IF(AND(SHAPE=B46,SHAPEW>0,C48>0),\"RADIUS MUST BE GREATER THAN \"&C47,IF(AND(SHAPE=B46,J49>0,J49<GlassMinW),\"Glass Width is Under Minimum\",IF(AND(SHAPE=B46,J48>0,J48<GlassMinH),\"Glass Height is Under Minimum\",\"\"))))","v":""},null,"Glass Width",{"$f":"IF(AND(SHAPEW>0,SHAPEH>0,DIM_4>0,OFFSET>0,SHAPE=B46),SHAPEW-(2*OFFSET),0)","v":0},{"$f":"IF(AND(SHAPEW>0,SHAPEH>0,DIM_4>0,OFFSET>0,SHAPE=B46),SHAPEW-(2*CUTOFFSET),0)","v":0},null,null,null,null,null,null,"A77K",{"$f":"IF(SHAPE=$B$38,7,0)","v":0},{"$f":"IF(S48>0,\"Min. Height:\",0)","v":0},{"$f":"IF(S49>0,H39,0)","v":0},{"$f":"IF(AND(S49>0,SHAPEH>0,SHAPEH<U49),1,0)","v":0},null,null,null,null,47,"A682","Casement",15.75,"17.5",36,78,114,null,46,"A79J","A79J (1/4 Octagon)",null,null,null,"A77G",1,null,null,null,null,"A78K",{"$f":"$J$41","v":0},{"$f":"$J$40","v":0},0]
[null,null,null,null,null,null,null,null,"Glass Leg Height",{"$f":"IF(AND(SHAPEW>0,OFFSET>0,DIM_4>0,SHAPE=B46),DIM_4-(OFFSET+((J46*COS((2*(ASIN(SHAPEW/(2*J46))))/2))-(J47*COS((2*(ASIN((SHAPEW-(2*OFFSET))/(2*J47))))/2)))),0)","v":0},{"$f":"IF(AND(SHAPEW>0,OFFSET>0,DIM_4>0,SHAPE=B46),DIM_4-(CUTOFFSET+((J46*COS((2*(ASIN(SHAPEW/(2*J46))))/2))-(K47*COS((2*(ASIN((SHAPEW-(2*CUTOFFSET))/(2*K47))))/2)))),0)","v":0},null,null,null,null,null,null,"A77K",{"$f":"IF(SHAPE=$B$38,8,0)","v":0},{"$f":"IF(S50>0,\"Max Width:\",0)","v":0},{"$f":"IF(S50>0,D39,0)","v":0},{"$f":"IF(AND(S50>0,SHAPEW>0,SHAPEW>U50),1,0)","v":0},null,null,null,null,48,"A690","PW","11.5","11.5",120,120,180,null,47,"A79K","A79K (Eyebrow)",null,null,null,"A78A",1,null,null,null,null,"A78L",{"$f":"$K$59","v":0},{"$f":"$K$58","v":0},0]
[null,null,null,null,null,null,null,null,"Cut L @ Sill & Vert",{"$f":"IF(AND(SHAPEW>0,SHAPEH>0,DIM_4>0,OFFSET>0,SHAPE=B46),SQRT(CUTOFFSET^2+((SHAPEW-K49)/2)^2),0)","v":0},{"$f":"IF(AND(SHAPEW>0,SHAPEH>0,DIM_4>0,OFFSET>0,SHAPE=B46),SQRT(CUTOFFSET^2+((SHAPEW-K49)/2)^2),0)","v":0},null,null,null,null,null,null,"A77K",{"$f":"IF(SHAPE=$B$38,9,0)","v":0},{"$f":"IF(S51>0,\"Max UI:\",0)","v":0},{"$f":"IF(S51>0,E39,0)","v":0},{"$f":"IF(AND(S51>0,E40>0),1,0)","v":0},null,null,null,null,49,"A691","Awning","17.5","11.5",48,48,96,null,48,"A79L","A79L (Half Eyebrow)",null,null,null,"A78B",1,null,null,null,null,"A78N",{"$f":"$K$193","v":0},{"$f":"$K$194","v":0},0]
[null,null,null,null,null,null,null,null,"Cut L @ Leg & Arc:",{"$f":"IF(AND(SHAPEW>0,SHAPEH>0,DIM_4>0,OFFSET>0,SHAPE=B46),SQRT(CUTOFFSET^2+((DIM_4-CUTOFFSET)-K50)^2),0)","v":0},null,null,null,null,null,null,null,"A77K",{"$f":"IF(SHAPE=$B$38,10,0)","v":0},{"$f":"IF(S52>0,\"Arc Length:\",0)","v":0},{"$f":"IF(S52>0,J44,0)","v":0},{"$f":"IF(AND(S52>0,J44>157),1,0)","v":0},null,null,null,null,50,"A692","Casement",15.75,"17.5",36,78,114,null,49,"A79N","A79N (Isosceles Triangle)",null,null,null,"A78C",1,null,null,null,null,"A78P",{"$f":"$J$182","v":0},{"$f":"$J$183","v":0},0]
[null,null,null,null,null,null,null,null,"Angle of Cut @ Leg & Arc:",{"$f":"IF(AND(SHAPEW>0,SHAPEH>0,DIM_4>0,OFFSET>0,SHAPE=B46),DEGREES(ACOS(CUTOFFSET/J52)),0)","v":0},null,null,null,null,null,null,null,{"$f":"$B$46","v":"A77V"},{"$f":"IF(SHAPE=$B$46,1,0)","v":0},{"$f":"IF(S53>0,\"Frame Radius:\",0)","v":0},{"$f":"IF(S53>0,J46,0)","v":0},{"$f":"IF(AND(S53>0,C48>0),1,0)","v":0},null,null,null,null,51,"A17A","Sidelite","11.5","47.5","84","96","180",null,50,"A79P","A79P (Right Triangle)",null,null,null,"A78G",1,null,null,null,null,"A78Q",{"$f":"$J$172","v":0},{"$f":"$J$173","v":0},0]
[null,null,null,null,null,null,null,null,"Arc Length",{"$f":"IF(AND(SHAPEW>0,SHAPEH>0,OFFSET>0,SHAPE=B46),J46*(2*(ASIN(SHAPEW/(2*J46)))),0)","v":0},null,null,null,null,null,null,null,"A77V",{"$f":"IF(SHAPE=$B$46,2,0)","v":0},{"$f":"IF(S54>0,\"Frame Leg:\",0)","v":0},{"$f":"IF(S54>0,DIM_4,0)","v":0},{"$f":"IF(AND(S54>0,G48>0),1,0)","v":0},null,null,null,null,52,"AC7A","Sidelite","11.5","47.5","84","96","180",null,51,"A79Q","A79Q (Right Triangle W/Leg)",null,null,null,"A79A",1,null,null,null,null,"A78R",{"$f":"$J$10","v":0},{"$f":"$J$11","v":0},0]
[null,null,null,null,null,null,null,null,null,null,null,null,null,null,null,null,null,"A77V",{"$f":"IF(SHAPE=$B$46,3,0)","v":0},{"$f":"IF(S55>0,\"Glass Radius:\",0)","v":0},{"$f":"IF(S55>0,J47,0)","v":0},null,null,null,null,null,53,"A171","Transom","47.5","11.5","108","49","156",null,52,"A79R","A79R (Circle Top w/Ex Leg)",null,null,null,"A79B",1,null,null,null,null,"A78S",{"$f":"$J$162","v":0},{"$f":"$J$159","v":0},0]
[null,{"$f":"IF(SHAPESELECT=70,\"A77L\",IF(SHAPESELECT=80,\"A78L\",IF(SHAPESELECT=90,\"A79L\",\"A115\")))","v":"A77L"},"Min R","Max W","Min Leg","Max UI","Cut L","Max H",null,"Frame Radius",{"$f":"IF(AND(SHAPEW>0,SHAPEH>0,OFFSET>0,SHAPE=B56),IF(SHAPEH>SHAPEW,(SHAPEW/2)+((SHAPEH*2)^2/(8*SHAPEW)),((SHAPEW)^2+SHAPEH^2)/(2*SHAPEH)),0)","v":0},null,null,null,null,null,null,"A77V",{"$f":"IF(SHAPE=$B$46,4,0)","v":0},{"$f":"IF(S56>0,\"Glass Width:\",0)","v":0},{"$f":"IF(S56>0,J49,0)","v":0},{"$f":"IF(AND(U56>0,U56<GlassMinW),1,0)","v":0},null,null,null,null,54,"A172","XO or OX","47.5","47.5",96,96,192,null,53,"A79S","A79S (Pentagon)",null,null,null,"A79C",1,null,null,null,null,"A78U",{"$f":"$J$31","v":0},{"$f":"$J$32","v":0},0]
[null,{"$f":"EXT","v":1},{"$f":"MINRADIUS","v":0},{"$f":"MAX_W","v":0},{"$f":"MINLEG","v":0},{"$f":"MAX_UI","v":0},{"$f":"MAXCUT","v":0},{"$f":"MAX_H","v":0},null,"Glass Radius",{"$f":"IF(AND(SHAPEW>0,SHAPEH>0,OFFSET>0,SHAPE=B56),K56-OFFSET,0)","v":0},{"$f":"IF(AND(SHAPEW>0,SHAPEH>0,OFFSET>0,SHAPE=B56),K56-CUTOFFSET,0)","v":0},null,null,null,null,null,"A77V",{"$f":"IF(SHAPE=$B$46,5,0)","v":0},{"$f":"IF(S57>0,\"Glass Height:\",0)","v":0},{"$f":"IF(S57>0,J48,0)","v":0},{"$f":"IF(AND(U57>0,U57<GlassMinH),1,0)","v":0},null,null,null,null,55,"AC72","XO or OX","47.5","47.5",120,"96",200,null,54,"A79U","A79U (Quarter Arch w/Ex Leg)",null,null,null,"A79G",1,null,null,null,null,"A78V",{"$f":"$J$49","v":0},{"$f":"$J$48","v":0},0]
[null,null,{"$f":"IF(AND(SHAPEW>0,SHAPEH>0,SHAPE=B56,K56<C57),1,0)","v":0},{"$f":"IF(AND(SHAPEW>0,OFFSET>0,SHAPE=B56,SHAPEW>D57),1,0)","v":0},{"$f":"IF(AND(SHAPEW>0,SHAPEH>0,SHAPE=B56,OR(SHAPEW<E57,SHAPEH<E57)),1,0)","v":0},{"$f":"IF(AND(SHAPEW>0,OFFSET>0,SHAPEH>0,SHAPE=B56,(SHAPEW+SHAPEH)>F57),1,0)","v":0},{"$f":"IF(AND(SHAPEW>0,SHAPEH>0,SHAPE=B56,OR(K62>G57,K61>G57)),1,0)","v":0},{"$f":"IF(AND(SHAPEH>0,OFFSET>0,SHAPE=B56,SHAPEH>H57),1,0)","v":0},null,"Glass Height",{"$f":"IF(AND(SHAPEW>0,SHAPEH>0,OFFSET>0,SHAPE=B56),IF(SHAPEW>SHAPEH,SHAPEH-((OFFSET*2)+K64),((2*SQRT((K59+K64)*((2*K57)-(K59+K64))))/2)-OFFSET),0)","v":0},{"$f":"IF(AND(SHAPEW>0,SHAPEH>0,OFFSET>0,SHAPE=B56),IF(SHAPEW>SHAPEH,SHAPEH-((CUTOFFSET*2)+K65),SHAPEH-CUTOFFSET-SQRT(K62^2-CUTOFFSET^2)),0)","v":0},null,null,null,null,null,"A77V",{"$f":"IF(SHAPE=$B$46,6,0)","v":0},{"$f":"IF(S58>0,\"Glass Leg:\",0)","v":0},{"$f":"IF(S58>0,J50,0)","v":0},null,null,null,null,null,56,"A173","XOO or OOX","71.5",47.5,108,96,204,null,55,"A79V","A79V (Eyebrow w/Ex Leg)",null,null,null,"A105",1,null,null,null,null,"A78W",{"$f":"$J$71","v":0},{"$f":"$J$70","v":0},0]
[null,null,{"$f":"MAX(C58:H58)","v":0},{"$f":"IF(AND(SHAPE=B56,C59=1),1,0)","v":0},{"$f":"IF(AND(SHAPEW>0,SHAPEH>0,SHAPEH=SHAPEW),1,0)","v":0},{"$f":"IF(AND(SHAPE=B56,E59=1),\"THIS IS A QUARTER ROUND\",IF(AND(SHAPE=B56,SHAPEW>0,C58>0),\"RADIUS MUST BE GREATER THAN \"&C57,IF(AND(SHAPE=B56,K59>0,K59<GlassMinW),\"Glass Width is Under Minimum\",IF(AND(SHAPE=B56,K58>0,K58<GlassMinH),\"Glass Height is Under Minimum\",\"\"))))","v":""},null,null,null,"Glass Width",{"$f":"IF(AND(SHAPEW>0,SHAPEH>0,OFFSET>0,SHAPE=B56),IF(SHAPEW>SHAPEH,((2*SQRT((K58+K64)*((2*K57)-(K58+K64))))/2)-OFFSET,SHAPEW-((OFFSET*2)+K64)),0)","v":0},{"$f":"IF(AND(SHAPEW>0,SHAPEH>0,OFFSET>0,SHAPE=B56),IF(SHAPEW>SHAPEH,((2*SQRT((L58+K65)*((2*L57)-(L58+K65))))/2)-CUTOFFSET,SHAPEW-((CUTOFFSET*2)+K65)),0)","v":0},null,null,null,null,null,"A77V",{"$f":"IF(SHAPE=$B$46,7,0)","v":0},{"$f":"IF(S59>0,\"Angle @ Sill & Leg:\",0)","v":0},{"$f":"IF(S59>0,45,0)","v":0},null,null,null,null,null,57,"AC73","XOO or OOX","71.5","71.5",130,"96","216",null,56,"A79W","A79W (Half Eyebrow w/Ex Leg)",null,null,null,"A111",1,null,null,null,null,"A78Y",{"$f":"$J$139","v":0},{"$f":"$J$140","v":0},0]
[null,null,null,null,null,null,null,null,null,"Cut Angle",{"$f":"IF(AND(SHAPEW>0,SHAPEH>0,OFFSET>0,SHAPE=B56),IF(SHAPEW>SHAPEH,DEGREES(ATAN(CUTOFFSET/(SHAPEW-(L59+CUTOFFSET)))),DEGREES(ATAN(CUTOFFSET/(SHAPEH-(L58+CUTOFFSET))))),0)","v":0},null,null,null,null,null,null,"A77V",{"$f":"IF(SHAPE=$B$46,8,0)","v":0},{"$f":"IF(S60>0,\"Cut L @ Sill & Leg:\",0)","v":0},{"$f":"IF(S60>0,J51,0)","v":0},{"$f":"IF(AND(S60>0,SHAPE=$B$46,J51>10.25),1,0)","v":0},null,null,null,null,58,"A175","OXXO",95.5,47.5,142,96,238,null,57,"A79Y","A79Y (Half Octagon w/Ex Leg)",null,null,null,"A118",1,null,null,null,null,"A78Z",{"$f":"$J$151","v":0},{"$f":"$J$152","v":0},0]
[null,null,null,null,null,null,null,null,null,"CUT Length",{"$f":"IF(AND(SHAPEW>0,SHAPEH>0,OFFSET>0,SHAPE=B56),SQRT(CUTOFFSET^2+((SHAPEW-(L59+CUTOFFSET))^2)),0)","v":0},null,null,null,null,null,null,"A77V",{"$f":"IF(SHAPE=$B$46,9,0)","v":0},{"$f":"IF(S61>0,\"Angle @ Leg & Arc:\",0)","v":0},{"$f":"IF(S61>0,J53,0)","v":0},null,null,null,null,null,59,"AC75","OXXO","95.5","47.5","144","96","240",null,58,"A79Z","A79Z (1/4 Octagon w/Ex Leg)",null,null,null,"A120",1,null,null,null,null,"A79A",{"$f":"$I$82","v":0},{"$f":"$I$83","v":0},0]
[null,null,null,null,null,null,null,null,null,"Cut L @ Peak",{"$f":"IF(AND(SHAPEW>0,SHAPEH>0,OFFSET>0,SHAPE=B56),SQRT((SHAPEH-CUTOFFSET-(IF(SHAPEW>SHAPEH,SHAPEH-((CUTOFFSET*2)+K65),((2*SQRT((L59+K65)*((2*L57)-(L59+K65))))/2)-CUTOFFSET)))^2+CUTOFFSET^2),0)","v":0},null,null,null,null,null,null,"A77V",{"$f":"IF(SHAPE=$B$46,10,0)","v":0},{"$f":"IF(S62>0,\"Cut L @ Leg & Arc:\",0)","v":0},{"$f":"IF(S62>0,J52,0)","v":0},{"$f":"IF(AND(S62>0,SHAPE=$B$46,J52>10.25),1,0)","v":0},null,null,null,null,60,"A980","Skylight","23.5","23.5",51,51,102,null,59,"A105","A105 (Circle Top)","A7_B",null,null,"A122",1,null,null,null,null,"A79B",{"$f":"$I$5","v":0},{"$f":"$I$4","v":0},0]
[null,null,null,null,null,null,null,null,null,"Cut Angle @ Peak",{"$f":"IF(AND(SHAPEW>0,SHAPEH>0,OFFSET>0,SHAPE=B56),90-(DEGREES(ACOS(CUTOFFSET/K62))),0)","v":0},null,null,null,null,null,null,"A77V",{"$f":"IF(SHAPE=$B$46,11,0)","v":0},{"$f":"IF(S63>0,\"Max Width:\",0)","v":0},{"$f":"IF(S63>0,D47,0)","v":0},{"$f":"IF(AND(S63>0,SHAPEW>0,SHAPEW>U63),1,0)","v":0},null,null,null,null,61,"A480","Garden Window","32","34.375","72","60","114",null,60,"A110","A110 (Circle Top w/Ex Leg)","A7_R",null,null,"A124",1,null,null,null,null,"A79C",{"$f":"$I$22","v":0},{"$f":"$I$22","v":0},0]
[null,null,null,null,null,null,null,null,null,"Difference",{"$f":"IF(AND(SHAPEW>0,SHAPEH>0,OFFSET>0,SHAPE=B56),K57-(K57*(COS((2*(ASIN((OFFSET*2)/(2*K57))))/2))),0)","v":0},null,null,null,null,null,null,"A77V",{"$f":"IF(SHAPE=$B$46,12,0)","v":0},{"$f":"IF(S64>0,\"Max Height:\",0)","v":0},{"$f":"IF(S64>0,D47,0)","v":0},{"$f":"IF(AND(S64>0,SHAPEH>0,SHAPEH>U64),1,0)","v":0},null,null,null,null,62,"6502","2 Lite PD","48","72","96","96","192",null,61,"A111","A111 (Quarter Arch)","A7_C",null,null,"A131",1,null,null,null,null,"A79D",{"$f":"$U$106","v":0},{"$f":"$U$107","v":0},0]
[null,null,null,null,null,null,null,null,null,"Difference",{"$f":"IF(AND(SHAPEW>0,SHAPEH>0,OFFSET>0,SHAPE=B56),L57-(L57*(COS((2*(ASIN((CUTOFFSET*2)/(2*L57))))/2))),0)","v":0},null,null,null,null,null,null,"A77V",{"$f":"IF(SHAPE=$B$46,13,0)","v":0},{"$f":"IF(S65>0,\"Max UI:\",0)","v":0},{"$f":"IF(S65>0,F47,0)","v":0},{"$f":"IF(AND(S65>0,F48>0),1,0)","v":0},null,null,null,null,63,"6503","3 Lite PD","84","72","144","96","240",null,62,"A112","A112 (Quarter Arch w/Ex Leg)","A7_U",null,null,null,{"$f":"IF(ISERROR(VLOOKUP(SHAPE,AP45:AQ64,2,FALSE)),0,VLOOKUP(SHAPE,AP45:AQ64,2,FALSE))","v":1},null,null,null,null,"A79G",{"$f":"$I$124","v":0},{"$f":"$I$123","v":0},0]
[null,null,null,null,null,null,null,null,null,null,null,null,null,null,null,null,null,"A77V",{"$f":"IF(SHAPE=$B$46,14,0)","v":0},{"$f":"IF(S66>0,\"Arc Length:\",0)","v":0},{"$f":"IF(S66>0,J54,0)","v":0},{"$f":"IF(AND(S66>0,J54>157),1,0)","v":0},null,null,null,null,64,"6504","4 Lite PD","96","72","144","96","240",null,63,"A113","A113 (Eyebrow)","A7_K",null,null,null,null,null,null,null,null,"A79H",{"$f":"$K$105","v":0},{"$f":"$K$106","v":0},0]
[null,null,null,null,null,null,null,null,null,null,null,null,null,null,null,null,null,{"$f":"$B$56","v":"A77L"},{"$f":"IF(SHAPE=$B$56,1,0)","v":0},{"$f":"IF(S67>0,\"Frame Radius:\",0)","v":0},{"$f":"IF(S67>0,K56,0)","v":0},{"$f":"IF(AND(S67>0,C58>0),1,0)","v":0},null,null,null,null,65,"6505","5 ft. PD",60,80,60,96,156,null,64,"A114","A114 (Eyebrow w/Ex Leg)","A7_V",null,null,null,"Models require Dim3",null,null,null,null,"A79J",{"$f":"$K$116","v":0},{"$f":"$K$117","v":0},0]
[null,{"$f":"IF(SHAPESELECT=70,\"A77W\",IF(SHAPESELECT=80,\"A78W\",IF(SHAPESELECT=90,\"A79W\",\"A116\")))","v":"A77W"},"Min R","Max W","Max H","Max UI","Cut L","Dim. 4","Frame Radius",{"$f":"IF(AND(SHAPEW>0,SHAPEH>0,OFFSET>0,DIM_4>0,SHAPE=B68,SHAPEW>(SHAPEH-DIM_4)),(((SHAPEW*2)/2)^2+(SHAPEH-DIM_4)^2)/(2*(SHAPEH-DIM_4)),IF(AND(SHAPEW>0,SHAPEH>0,OFFSET>0,DIM_4>0,SHAPE=B68,SHAPEW<=(SHAPEH-DIM_4)),(SHAPEW/2)+(((SHAPEH-DIM_4)*2)^2)/(8*SHAPEW),0))","v":0},null,null,null,null,null,null,null,"A77L",{"$f":"IF(SHAPE=$B$56,2,0)","v":0},{"$f":"IF(S68>0,\"Glass Radius:\",0)","v":0},{"$f":"IF(S68>0,K57,0)","v":0},null,null,null,null,null,66,"6506","6 ft. PD",72,80,72,96,168,null,65,"A115","A115 (Half Eyebrow)","A7_L",null,null,"A77H",1,null,null,null,null,"A79K",{"$f":"$J$41","v":0},{"$f":"$J$40","v":0},0]
[null,{"$f":"EXT","v":1},{"$f":"MINRADIUS","v":0},{"$f":"MAX_W","v":0},{"$f":"MAX_H","v":0},{"$f":"MAX_UI","v":0},{"$f":"MAXCUT","v":0},{"$f":"MINLEG","v":0},"Glass Radius",{"$f":"IF(AND(SHAPEW>0,SHAPEH>0,OFFSET>0,DIM_4>0,SHAPE=B68),J68-OFFSET,0)","v":0},{"$f":"IF(AND(SHAPEW>0,SHAPEH>0,OFFSET>0,DIM_4>0,SHAPE=B68),J68-CUTOFFSET,0)","v":0},null,null,null,null,null,null,"A77L",{"$f":"IF(SHAPE=$B$56,3,0)","v":0},{"$f":"IF(S69>0,\"Glass Width:\",0)","v":0},{"$f":"IF(S69>0,K59,0)","v":0},{"$f":"IF(AND(U69>0,U69<GlassMinW),1,0)","v":0},null,null,null,null,67,"6508","8 ft. PD",96,80,96,96,192,null,66,"A116","A116 (Half Eyebrow w/Ex Leg)","A7_W",null,null,"A77J",1,null,null,null,null,"A79L",{"$f":"$K$59","v":0},{"$f":"$K$58","v":0},0]
[null,null,{"$f":"IF(AND(SHAPEW>0,SHAPEH>0,SHAPE=B68,J68<C69),1,0)","v":0},{"$f":"IF(AND(SHAPEW>0,OFFSET>0,SHAPE=B68,SHAPEW>D69),1,0)","v":0},{"$f":"IF(AND(SHAPEW>0,OFFSET>0,SHAPE=B68,SHAPEH>E69),1,0)","v":0},{"$f":"IF(AND(SHAPEW>0,SHAPEH>0,OFFSET>0,SHAPE=B68,(SHAPEW+SHAPEH)>F69),1,0)","v":0},{"$f":"IF(AND(SHAPEW>0,SHAPEH>0,SHAPE=B68,OR(J74>G69,J75>G69,J77>G69)),1,0)","v":0},{"$f":"IF(AND(SHAPEW>0,SHAPE=B68,DIM_4<H69),1,0)","v":0},"Glass Height",{"$f":"IF(AND(SHAPEW>0,SHAPEH>0,OFFSET>0,DIM_4>0,SHAPE=B68),SHAPEH-((OFFSET*2)+K78),0)","v":0},{"$f":"IF(AND(SHAPEW>0,SHAPEH>0,OFFSET>0,DIM_4>0,SHAPE=B68),SHAPEH-((CUTOFFSET*2)+M78),0)","v":0},null,null,null,null,null,null,"A77L",{"$f":"IF(SHAPE=$B$56,4,0)","v":0},{"$f":"IF(S70>0,\"Glass Height:\",0)","v":0},{"$f":"IF(S70>0,K58,0)","v":0},{"$f":"IF(AND(U70>0,U70<GlassMinH),1,0)","v":0},null,null,null,null,68,"6509","9 ft. PD",108,80,108,96,204,null,67,"A117","A117 (Ellipse)",null,null,null,"A77Q",1,null,null,null,null,"A79N",{"$f":"$K$193","v":0},{"$f":"$K$194","v":0},0]
[null,null,{"$f":"MAX(C70:H70)","v":0},{"$f":"IF(AND(SHAPE=B68,C71=1),1,0)","v":0},null,null,{"$f":"IF(AND(SHAPE=B68,SHAPEW>0,C70>0),\"RADIUS MUST BE GREATER THAN \"&C69,IF(AND(SHAPE=B68,J71>0,J71<GlassMinW),\"Glass Width is Under Minimum\",IF(AND(SHAPE=B68,J70>0,J70<GlassMinH),\"Glass Height is Under Minimum\",IF(AND(SHAPE=B68,SHAPEW>0,SHAPEH>0,DIM_4>0,SHAPEW=(SHAPEH-DIM_4)),\"This is a 1/4 Round with Extended Leg\",\"\"))))","v":""},null,"Glass Width",{"$f":"IF(AND(SHAPEW>0,SHAPEH>0,OFFSET>0,DIM_4>0,SHAPE=B68),SHAPEW-(2*OFFSET),0)","v":0},{"$f":"IF(AND(SHAPEW>0,SHAPEH>0,OFFSET>0,DIM_4>0,SHAPE=B68),SHAPEW-(2*CUTOFFSET),0)","v":0},null,null,null,null,null,null,"A77L",{"$f":"IF(SHAPE=$B$56,5,0)","v":0},{"$f":"IF(S71>0,\"Angle @ Sill & Arc:\",0)","v":0},{"$f":"IF(S71>0,K60,0)","v":0},null,null,null,null,null,69,"6512","12 ft. 4 Lite PD",144,80,144,96,240,null,68,"A118","A118 (Full Circle)","A7_A",null,null,"A77S",1,null,null,null,null,"A79P",{"$f":"$J$182","v":0},{"$f":"$J$183","v":0},0]
[null,null,null,null,null,null,null,null,"Glass Leg Height",{"$f":"IF(AND(SHAPEW>0,SHAPE=B68,DIM_4>0,OFFSET>0,SHAPEW>(SHAPEH-DIM_4)),DIM_4-(OFFSET+((J68*COS((2*(ASIN((SHAPEW*2)/(2*J68))))/2))-(J69*COS((2*(ASIN(((SHAPEW*2)-(2*OFFSET))/(2*J69))))/2)))),IF(AND(SHAPEW>0,SHAPE=B68,DIM_4>0,OFFSET>0,SHAPEW<=(SHAPEH-DIM_4)),DIM_4-OFFSET,0))","v":0},{"$f":"IF(AND(SHAPEW>0,SHAPE=B68,DIM_4>0,OFFSET>0,SHAPEW>(SHAPEH-DIM_4)),DIM_4-(CUTOFFSET+((J68*COS((2*(ASIN((SHAPEW*2)/(2*J68))))/2))-(K69*COS((2*(ASIN(((SHAPEW*2)-(2*CUTOFFSET))/(2*K69))))/2)))),IF(AND(SHAPEW>0,SHAPE=B68,DIM_4>0,CUTOFFSET>0,SHAPEW<=(SHAPEH-DIM_4)),DIM_4-CUTOFFSET,0))","v":0},null,null,null,null,null,null,"A77L",{"$f":"IF(SHAPE=$B$56,6,0)","v":0},{"$f":"IF(S72>0,\"Cut L @ Sill & Arc:\",0)","v":0},{"$f":"IF(S72>0,K61,0)","v":0},{"$f":"IF(AND(S72>0,SHAPE=B46,G58>10.25),1,0)","v":0},null,null,null,null,70,"6522","12 ft. 3 Lite PD",144,80,144,96,240,null,69,"A119","A119 (Oval)","A7_D",null,null,"A77Y",1,null,null,null,null,"A79Q",{"$f":"$J$172","v":0},{"$f":"$J$173","v":0},0]
[null,null,null,null,null,null,null,null,"Angle @ Peak",{"$f":"IF(AND(SHAPEW>0,SHAPEH>0,DIM_4>0,OFFSET>0,SHAPE=B68),90-(DEGREES(ACOS(CUTOFFSET/J75))),0)","v":0},null,null,null,null,null,null,null,"A77L",{"$f":"IF(SHAPE=$B$56,7,0)","v":0},{"$f":"IF(S73>0,\"Angle @ Peak:\",0)","v":0},{"$f":"IF(S73>0,K63,0)","v":0},null,null,null,null,null,1,{"$f":"IF(MODELLINK=1,\"\",VLOOKUP(MODELLINK,CHART,2,FALSE))","v":""},{"$f":"IF(MODELLINK=1,\"\",VLOOKUP(MODELLINK,CHART,3,FALSE))","v":""},{"$f":"IF(MODELLINK=1,\"\",VLOOKUP(MODELLINK,CHART,4,FALSE))","v":""},{"$f":"IF(MODELLINK=1,\"\",VLOOKUP(MODELLINK,CHART,5,FALSE))","v":""},{"$f":"IF(MODELLINK=1,\"\",VLOOKUP(MODELLINK,CHART,6,FALSE))","v":""},{"$f":"IF(MODELLINK=1,\"\",VLOOKUP(MODELLINK,CHART,7,FALSE))","v":""},{"$f":"IF(MODELLINK=1,\"\",VLOOKUP(MODELLINK,CHART,8,FALSE))","v":""},null,70,"A120","A120 (Hexagon)",null,null,null,"A77Z",1,null,null,null,null,"A79R",{"$f":"$J$10","v":0},{"$f":"$J$11","v":0},0]
[null,null,null,null,null,null,null,null,"Cut L @ Sill & Vert",{"$f":"IF(AND(SHAPEW>0,SHAPEH>0,OFFSET>0,DIM_4>0,SHAPE=B68),SQRT(CUTOFFSET^2+((SHAPEW-K71)/2)^2),0)","v":0},null,null,null,null,null,null,null,"A77L",{"$f":"IF(SHAPE=$B$56,8,0)","v":0},{"$f":"IF(S74>0,\"Cut L @ Peak:\",0)","v":0},{"$f":"IF(S74>0,K62,0)","v":0},{"$f":"IF(AND(S74>0,SHAPE=$B$46,L65>10.25),1,0)","v":0},null,null,null,null,null,null,null,null,null,null,null,null,null,71,"A121","A121 (Hexagon w/Ex Leg)",null,null,null,"A78H",1,null,null,null,null,"A79S",{"$f":"$J$162","v":0},{"$f":"$J$159","v":0},0]
[null,null,null,null,null,null,null,null,"Cut L @ Peak",{"$f":"IF(AND(SHAPEH>0,OFFSET>0,DIM_4>0,SHAPE=B68),SQRT(CUTOFFSET^2+(SHAPEH-(K70+CUTOFFSET))^2),0)","v":0},null,null,null,null,null,null,null,"A77L",{"$f":"IF(SHAPE=$B$56,9,0)","v":0},{"$f":"IF(S75>0,\"Max Width:\",0)","v":0},{"$f":"IF(S75>0,D57,0)","v":0},{"$f":"IF(AND(S75>0,SHAPEW>0,SHAPEW>U75),1,0)","v":0},null,null,null,null,null,null,null,null,null,null,null,null,null,72,"A122","A122 (Octagon)","A7_G",null,null,"A78J",1,null,null,null,null,"A79U",{"$f":"$J$31","v":0},{"$f":"$J$32","v":0},0]
[null,null,null,null,null,null,null,null,"Cut Angle @ Leg & Arc",{"$f":"IF(AND(SHAPEW>0,SHAPEH>0,DIM_4>0,OFFSET>0,SHAPE=B68),DEGREES(ACOS(CUTOFFSET/J77)),0)","v":0},{"$f":"IF(AND(OFFSET>0,SHAPEW>0,SHAPEH>0,SHAPE=B68,SHAPEW>=(SHAPEH-DIM_4)),2*(ASIN((OFFSET*2)/(2*J69))),IF(AND(OFFSET>0,SHAPEW>0,SHAPEH>0,SHAPE=B68,SHAPEW<(SHAPEH-DIM_4)),2*(ASIN(((J69-J71)*2)/(2*J69))),0))","v":0},"F",{"$f":"IF(AND(OFFSET>0,SHAPEW>0,SHAPEH>0,SHAPE=B68,SHAPEW>=(SHAPEH-DIM_4)),2*(ASIN((CUTOFFSET*2)/(2*K69))),IF(AND(OFFSET>0,SHAPEW>0,SHAPEH>0,SHAPE=B68,SHAPEW<(SHAPEH-DIM_4)),2*(ASIN(((K69-K71)*2)/(2*K69))),0))","v":0},null,null,null,null,"A77L",{"$f":"IF(SHAPE=$B$56,10,0)","v":0},{"$f":"IF(S76>0,\"Max Height:\",0)","v":0},{"$f":"IF(S76>0,H57,0)","v":0},{"$f":"IF(AND(S76>0,SHAPEH>0,SHAPEH>U76),1,0)","v":0},null,null,null,null,null,null,null,null,null,null,null,null,null,73,"A123","A123 (Octagon w/Ex Leg)",null,null,null,"A78Q",1,null,null,null,null,"A79V",{"$f":"$J$49","v":0},{"$f":"$J$48","v":0},0]
[null,null,null,null,null,null,null,null,"Cut L @ Leg & Arc",{"$f":"IF(AND(SHAPEW>0,SHAPEH>0,DIM_4>0,OFFSET>0,SHAPE=B68),SQRT(CUTOFFSET^2+((DIM_4-CUTOFFSET)-K72)^2),0)","v":0},{"$f":"IF(AND(SHAPEW>0,SHAPEH>0,OFFSET>0,DIM_4>0,SHAPE=B68),J69*COS(K76/2),0)","v":0},"d",{"$f":"IF(AND(SHAPEW>0,SHAPEH>0,OFFSET>0,DIM_4>0,SHAPE=B68),K69*COS(M76/2),0)","v":0},null,null,null,null,"A77L",{"$f":"IF(SHAPE=$B$56,11,0)","v":0},{"$f":"IF(S77>0,\"Max UI:\",0)","v":0},{"$f":"IF(S77>0,F57,0)","v":0},{"$f":"IF(AND(S77>0,F58>0),1,0)","v":0},null,null,null,null,null,null,null,null,null,null,null,null,null,74,"A124","A124 (Pentagon Equilateral)",null,null,null,"A78S",1,null,null,null,null,"A79W",{"$f":"$J$71","v":0},{"$f":"$J$70","v":0},0]
[null,null,null,null,null,null,null,null,null,null,{"$f":"IF(AND(SHAPEW>0,SHAPEH>0,OFFSET>0,DIM_4>0,SHAPE=B68,SHAPEW>=(SHAPEH-DIM_4)),J69-K77,IF(AND(SHAPEW>0,SHAPEH>0,OFFSET>0,DIM_4>0,SHAPE=B68,SHAPEW<(SHAPEH-DIM_4)),(SHAPEH-DIM_4)-K77-OFFSET,0))","v":0},"h",{"$f":"IF(AND(SHAPEW>0,SHAPEH>0,OFFSET>0,DIM_4>0,SHAPE=B68,SHAPEW>=(SHAPEH-DIM_4)),K69-M77,IF(AND(SHAPEW>0,SHAPEH>0,OFFSET>0,DIM_4>0,SHAPE=B68,SHAPEW<(SHAPEH-DIM_4)),(SHAPEH-DIM_4)-M77-CUTOFFSET,0))","v":0},null,null,null,null,{"$f":"$B$68","v":"A77W"},{"$f":"IF(SHAPE=$B$68,1,0)","v":0},{"$f":"IF(S78>0,\"Frame Radius:\",0)","v":0},{"$f":"IF(S78>0,J68,0)","v":0},{"$f":"IF(AND(S78>0,C70>0),1,0)","v":0},null,null,null,null,null,null,null,null,null,null,null,null,null,75,"A125","A125 (Half Pentagon)","A7_Z",null,null,"A78Y",1,null,null,null,null,"A79Y",{"$f":"$J$139","v":0},{"$f":"$J$140","v":0},0]
[null,null,null,null,null,null,null,null,null,null,null,null,null,null,null,null,null,"A77W",{"$f":"IF(SHAPE=$B$68,2,0)","v":0},{"$f":"IF(S79>0,\"Frame Leg:\",0)","v":0},{"$f":"IF(S79>0,DIM_4,0)","v":0},{"$f":"IF(AND(S79>0,H70>0),1,0)","v":0},null,null,null,null,null,null,null,null,null,null,null,null,null,76,"A126","A126 (Pentagon)","A7_S",null,null,"A78Z",1,null,null,null,null,"A79Z",{"$f":"$J$151","v":0},{"$f":"$J$152","v":0},0]
[null,{"$f":"IF(SHAPESELECT=70,\"A77A\",IF(SHAPESELECT=80,\"A78A\",IF(SHAPESELECT=90,\"A79A\",\"A118\")))","v":"A77A"},"Min R","Max W","Max UI",null,null,null,null,null,null,null,null,null,null,null,null,"A77W",{"$f":"IF(SHAPE=$B$68,3,0)","v":0},{"$f":"IF(S80>0,\"Glass Radius:\",0)","v":0},{"$f":"IF(S80>0,J69,0)","v":0},null,null,null,null,null,null,null,null,null,null,null,null,null,null,77,"A127","A127 (Cathedral)",null,null,null,"A79H",1,null,null,null,null,"A105",{"$f":"$I$5","v":0},{"$f":"$I$4","v":0},0]
[null,{"$f":"EXT","v":1},{"$f":"MINRADIUS","v":0},59.5,120,null,null,"Frame Height:",{"$f":"IF(AND(SHAPEW>0,OFFSET>0,SHAPE=B80),SHAPEW,0)","v":0},null,null,null,null,null,null,null,null,"A77W",{"$f":"IF(SHAPE=$B$68,4,0)","v":0},{"$f":"IF(S81>0,\"Glass Width:\",0)","v":0},{"$f":"IF(S81>0,J71,0)","v":0},{"$f":"IF(AND(U81>0,U81<GlassMinW),1,0)","v":0},null,null,null,null,null,null,null,null,null,null,null,null,null,78,"A128","A128 (Cathedral w/Ex Leg)",null,null,null,"A79J",1,null,null,null,null,"A110",{"$f":"$J$10","v":0},{"$f":"$J$11","v":0},0]
[null,null,{"$f":"IF(AND(SHAPEW>0,SHAPE=B80,(SHAPEW/2)<C81),1,0)","v":0},{"$f":"IF(AND(SHAPEW>0,OFFSET>0,SHAPE=B80,SHAPEW>D81),1,0)","v":0},{"$f":"IF(AND(SHAPEW>0,SHAPE=B80,OFFSET>0,(SHAPEW+I81)>E81),1,0)","v":0},null,null,"Glass Width:",{"$f":"IF(AND(SHAPEW>0,OFFSET>0,SHAPE=B80),SHAPEW-(OFFSET*2),0)","v":0},null,null,null,null,null,null,null,null,"A77W",{"$f":"IF(SHAPE=$B$68,5,0)","v":0},{"$f":"IF(S82>0,\"Glass Height:\",0)","v":0},{"$f":"IF(S82>0,J70,0)","v":0},{"$f":"IF(AND(U82>0,U82<GlassMinH),1,0)","v":0},null,null,null,null,null,null,null,null,null,null,null,null,null,79,"A129","A129 (Trapezoid)","A7_Q",null,null,"A79Q",1,null,null,null,null,"A111",{"$f":"$I$22","v":0},{"$f":"$I$22","v":0},0]
[null,null,{"$f":"MAX(C82:F82)","v":0},{"$f":"IF(AND(SHAPE=B80,C83=1),1,0)","v":0},null,{"$f":"IF(AND(SHAPE=B80,SHAPEW>0,C82>0),\"RADIUS MUST BE GREATER THAN\"&\" \"&C81,IF(AND(SHAPE=B80,SHAPEW>0,SHAPEH>0,SHAPEW<>SHAPEH),\"WIDTH AND HEIGHT MUST BE EQUAL\",IF(AND(SHAPE=B80,I82>0,I82<GlassMinW),\"Glass Width is Under Minimum\",IF(AND(SHAPE=B80,I83>0,I83<GlassMinH),\"Glass Height is Under Minimum\",\"\"))))","v":""},null,"Glass Height:",{"$f":"IF(AND(SHAPEW>0,OFFSET>0,SHAPE=B80),SHAPEW-(OFFSET*2),0)","v":0},null,null,null,null,null,null,null,null,"A77W",{"$f":"IF(SHAPE=$B$68,6,0)","v":0},{"$f":"IF(S83>0,\"Glass Leg:\",0)","v":0},{"$f":"IF(S83>0,J72,0)","v":0},null,null,null,null,null,null,null,null,null,null,null,null,null,null,80,"A130","A130 (Right Triangle)","A7_P",null,null,"A79S",1,null,null,null,null,"A112",{"$f":"$J$31","v":0},{"$f":"$J$32","v":0},0]
[null,null,null,null,null,null,null,"Frame Radius:",{"$f":"IF(AND(SHAPEW>0,OFFSET>0,SHAPE=B80),SHAPEW/2,0)","v":0},null,null,null,null,null,null,null,null,"A77W",{"$f":"IF(SHAPE=$B$68,7,0)","v":0},{"$f":"IF(S84>0,\"Angle @ Sill & Vert:\",0)","v":0},{"$f":"IF(S84>0,45,0)","v":0},null,null,null,null,null,null,null,null,null,null,null,null,null,null,81,"A131","A131 (Equilateral Triangle)",null,null,null,"A79Y",1,null,null,null,null,"A113",{"$f":"$J$41","v":0},{"$f":"$J$40","v":0},0]
[null,null,null,null,null,null,null,"Glass Radius:",{"$f":"IF(AND(SHAPEW>0,OFFSET>0,SHAPE=B80),(SHAPEW/2)-OFFSET,0)","v":0},null,null,null,null,null,null,null,null,"A77W",{"$f":"IF(SHAPE=$B$68,8,0)","v":0},{"$f":"IF(S85>0,\"Cut L @ Sill & Vert:\",0)","v":0},{"$f":"IF(S85>0,J74,0)","v":0},{"$f":"IF(AND(S85>0,J74>10.25),1,0)","v":0},null,null,null,null,null,null,null,null,null,null,null,null,null,82,"A132","A132 (Isosceles Triangle)","A7_N",null,null,"A79Z",1,null,null,null,null,"A114",{"$f":"$J$49","v":0},{"$f":"$J$48","v":0},0]
[null,null,null,null,null,null,null,null,null,null,null,null,null,null,null,null,null,"A77W",{"$f":"IF(SHAPE=$B$68,9,0)","v":0},{"$f":"IF(S86>0,\"Angle @ Leg & Arc:\",0)","v":0},{"$f":"IF(S86>0,J76,0)","v":0},null,null,null,null,null,null,null,null,null,null,null,null,null,"SHAPELINK >>",1,{"$f":"VLOOKUP(SHAPELINK,SHAPECHART,2,FALSE)","v":"Select"},{"$f":"VLOOKUP(SHAPELINK,SHAPECHART,3,FALSE)","v":"Select"},null,null,null,"A121",1,null,null,null,null,"A115",{"$f":"$K$59","v":0},{"$f":"$K$58","v":0},0]
[null,null,null,null,null,null,null,null,null,null,null,null,null,null,null,null,null,"A77W",{"$f":"IF(SHAPE=$B$68,10,0)","v":0},{"$f":"IF(S87>0,\"Cut L @ Leg & Arc:\",0)","v":0},{"$f":"IF(S87>0,J77,0)","v":0},{"$f":"IF(AND(S87>0,J77>10.25),1,0)","v":0},null,null,null,null,null,null,null,null,null,null,null,null,"SHAPESELECT >>",{"$f":"IF(AND(SHAPELINK>=1,SHAPELINK<21),70,IF(AND(SHAPELINK>=21,SHAPELINK<40),80,IF(AND(SHAPELINK>=40,SHAPELINK<59),90,IF(SHAPELINK>=59,200,0))))","v":70},null,null,null,null,null,"A123",1,null,null,null,null,"A116",{"$f":"$J$71","v":0},{"$f":"$J$70","v":0},0]
[null,{"$f":"IF(SHAPESELECT=70,\"A77D\",IF(SHAPESELECT=80,\"A78D\",IF(SHAPESELECT=90,\"A79D\",\"A119\")))","v":"A77D"},"Min R","Max W","Max H","Max UI","Max sq.ft",null,"Point B from center:",{"$f":"IF(AND(SHAPEW>0,SHAPEH>0,OFFSET>0,SHAPE=B88),(SHAPEW/2)-J96,0)","v":0},{"$f":"IF(AND(SHAPEW>0,SHAPEH>0,OFFSET>0,SHAPE=B88),(SHAPEW/2)-J96,0)","v":0},null,null,null,null,null,null,"A77W",{"$f":"IF(SHAPE=$B$68,11,0)","v":0},{"$f":"IF(S88>0,\"Angle @ Peak:\",0)","v":0},{"$f":"IF(S88>0,J73,0)","v":0},null,null,null,null,null,null,null,null,null,null,null,null,null,null,null,null,null,null,null,null,"A125",1,null,null,null,null,"A117",{"$f":"$J$209","v":0},{"$f":"$J$210","v":0},{"$f":"(AW88*AX88)/144","v":0}]
[null,{"$f":"EXT","v":1},{"$f":"MINRADIUS","v":0},{"$f":"MAX_W","v":0},{"$f":"MAX_H","v":0},{"$f":"MAX_UI","v":0},{"$f":"MAXSF","v":0},null,"Edge to Peak:",{"$f":"IF(AND(SHAPEW>0,SHAPEH>0,OFFSET>0,SHAPE=B88),SQRT((SHAPEW/2)^2+(SHAPEH/2)^2),0)","v":0},{"$f":"IF(AND(SHAPEW>0,SHAPEH>0,OFFSET>0,SHAPE=$B$88),K88/TAN(J94),0)","v":0},null,null,null,null,null,null,"A77W",{"$f":"IF(SHAPE=$B$68,12,0)","v":0},{"$f":"IF(S89>0,\"Cut L @ Peak:\",0)","v":0},{"$f":"IF(S89>0,J75,0)","v":0},{"$f":"IF(AND(S89>0,J75>10.25),1,0)","v":0},null,null,null,null,null,null,null,null,null,null,null,null,null,null,null,null,null,null,null,"A126",1,null,null,null,null,"A118",{"$f":"$I$82","v":0},{"$f":"$I$83","v":0},0]
[null,null,{"$f":"IF(AND(SHAPEW>0,SHAPE=B88,OR(J96<C89,J97<C89)),1,0)","v":0},{"$f":"IF(AND(SHAPEW>0,OFFSET>0,SHAPE=B88,SHAPEW>D89),1,0)","v":0},{"$f":"IF(AND(SHAPEH>0,OFFSET>0,SHAPE=B88,SHAPEH>E89),1,0)","v":0},{"$f":"IF(AND(SHAPEW>0,SHAPEH>0,SHAPE=B88,OFFSET>0,(SHAPEW+SHAPEH)>F89),1,0)","v":0},{"$f":"IF(AND(SHAPEW>0,SHAPEH>0,SHAPE=B88,OFFSET>0,((SHAPEW*SHAPEH)/144)>G89),1,0)","v":0},null,"Peak Radius:",{"$f":"IF(AND(SHAPEW>0,SHAPEH>0,OFFSET>0,SHAPE=B88),(SHAPEW/2)-(SHAPEH/2),0)","v":0},null,null,null,null,null,null,null,"A77W",{"$f":"IF(SHAPE=$B$68,13,0)","v":0},{"$f":"IF(S90>0,\"Max Width:\",0)","v":0},{"$f":"IF(S90>0,D69,0)","v":0},{"$f":"IF(AND(S90>0,SHAPEW>0,SHAPEW>U90),1,0)","v":0},null,null,null,null,null,null,null,null,null,null,null,null,null,null,null,null,null,null,null,"A129",1,null,null,null,null,"A119",{"$f":"$U$106","v":0},{"$f":"$U$107","v":0},0]
[null,null,{"$f":"MAX(C90:G90)","v":0},{"$f":"IF(AND(SHAPE=B88,C91=1),1,0)","v":0},null,{"$f":"IF(AND(SHAPE=B88,SHAPEW>0,C90>0),\"RADIUS MUST BE GREATER THAN \"&C89,IF(AND(SHAPE=B88,SHAPEW>0,SHAPEH>0,SHAPEW=SHAPEH),\"THIS IS A CIRCLE\",IF(AND(SHAPE=B88,U106>0,U106<GlassMinW),\"Glass Width is Under Minimum\",IF(AND(SHAPE=B88,U107>0,U107<GlassMinH),\"Glass Height is Under Minimum\",\"\"))))","v":""},null,null,"Hyp. From left to peak:",{"$f":"IF(AND(SHAPEW>0,SHAPEH>0,OFFSET>0,SHAPE=B88),J89-J90,0)","v":0},null,null,null,null,null,null,null,"A77W",{"$f":"IF(SHAPE=$B$68,14,0)","v":0},{"$f":"IF(S91>0,\"Max Height:\",0)","v":0},{"$f":"IF(S91>0,E69,0)","v":0},{"$f":"IF(AND(S91>0,SHAPEH>0,SHAPEH>U91),1,0)","v":0},null,null,null,null,null,null,null,null,null,null,null,null,null,null,null,null,null,null,null,null,{"$f":"IF(ISERROR(VLOOKUP(SHAPE,AP68:AQ90,2,FALSE)),0,IF(SHAPELINK>1,VLOOKUP(SHAPE,AP68:AQ90,2,FALSE),0))","v":0},null,null,null,null,"A120",{"$f":"$J$219","v":0},{"$f":"$J$220","v":0},0]
[null,null,null,null,null,null,null,null,"Angle of Cut:",{"$f":"IF(AND(SHAPEW>0,SHAPEH>0,OFFSET>0,SHAPE=B88),DEGREES(ATAN((SHAPEH/2)/(SHAPEW/2))),0)","v":0},null,null,null,null,null,null,null,"A77W",{"$f":"IF(SHAPE=$B$68,15,0)","v":0},{"$f":"IF(S92>0,\"Max UI:\",0)","v":0},{"$f":"IF(S92>0,F69,0)","v":0},{"$f":"IF(AND(S92>0,E78>0),1,0)","v":0},null,null,null,null,null,null,null,null,null,null,null,null,null,null,null,null,null,null,null,null,null,null,null,null,null,"A121",{"$f":"$K$230","v":0},{"$f":"$K$231","v":0},0]
[null,null,null,null,null,null,null,null,"1/2 Edge to Peak:",{"$f":"IF(AND(SHAPEW>0,SHAPEH>0,OFFSET>0,SHAPE=B88),J91/2,0)","v":0},null,null,null,null,null,null,null,{"$f":"$B$80","v":"A77A"},{"$f":"IF(SHAPE=$B$80,1,0)","v":0},{"$f":"IF(S93>0,\"Frame Width:\",0)","v":0},{"$f":"IF(S93>0,SHAPEW,0)","v":0},null,null,null,null,null,null,null,null,null,null,null,null,null,null,null,null,null,null,null,null,null,"Models require Dim3",null,null,null,null,"A122",{"$f":"$I$124","v":0},{"$f":"$I$123","v":0},0]
[null,null,"Major Arc Length:",{"$f":"((((SHAPEW/2)-(SQRT(((((SQRT((SHAPEW/2)^2+SHAPEH^2))-((SHAPEW/2)-SHAPEH))/2)*TAN((ACOS((SHAPEW/2)/(SQRT((SHAPEW/2)^2+SHAPEH^2))))))^2+(((SQRT((SHAPEW/2)^2+SHAPEH^2))-((SHAPEW/2)-SHAPEH))/2)^2)))/(TAN((ACOS((SHAPEW/2)/(SQRT((SHAPEW/2)^2+SHAPEH^2)))))))+SHAPEH)*((ACOS((SHAPEW/2)/(SQRT((SHAPEW/2)^2+SHAPEH^2))))*2)","v":{"$error":"#DIV/0!"}},null,null,null,null,"Angle of Edge to Peak:",{"$f":"IF(AND(SHAPEW>0,SHAPEH>0,OFFSET>0,SHAPE=B88),ACOS((SHAPEW/2)/J89),0)","v":0},null,null,null,null,null,null,null,"A77A",{"$f":"IF(SHAPE=$B$80,2,0)","v":0},{"$f":"IF(S94>0,\"Frame Height:\",0)","v":0},{"$f":"IF(S94>0,I81,0)","v":0},null,null,null,null,null,null,null,null,null,null,null,null,null,null,null,null,null,null,null,null,"A77V",1,null,null,null,null,"A123",{"$f":"$J$241","v":0},{"$f":"$J$242","v":0},0]
[null,null,"Minor Arc Length:",{"$f":"(SQRT(((((SQRT((SHAPEW/2)^2+SHAPEH^2))-((SHAPEW/2)-SHAPEH))/2)*TAN((ACOS((SHAPEW/2)/(SQRT((SHAPEW/2)^2+SHAPEH^2))))))^2+(((SQRT((SHAPEW/2)^2+SHAPEH^2))-((SHAPEW/2)-SHAPEH))/2)^2))*(2*(RADIANS(90-(DEGREES(ACOS((SHAPEW/2)/(SQRT((SHAPEW/2)^2+SHAPEH^2))))))))","v":{"$error":"#DIV/0!"}},null,null,null,null,"Distance to Major:",{"$f":"IF(AND(SHAPEW>0,SHAPEH>0,OFFSET>0,SHAPE=B88),J93*TAN(J94),0)","v":0},null,null,null,null,null,null,null,"A77A",{"$f":"IF(SHAPE=$B$80,3,0)","v":0},{"$f":"IF(S95>0,\"Frame Radius:\",0)","v":0},{"$f":"IF(S95>0,I84,0)","v":0},{"$f":"IF(AND(S95>0,C82>0),1,0)","v":0},null,null,null,null,null,null,null,null,null,null,null,null,null,null,null,null,null,null,null,"A77W",1,null,null,null,null,"A124",{"$f":"$I$253","v":0},{"$f":"$I$254","v":0},0]
[null,null,"Arc Length:",{"$f":"D94+D95","v":{"$error":"#DIV/0!"}},null,null,null,null,"Minor Radius:",{"$f":"IF(AND(SHAPEW>0,SHAPEH>0,OFFSET>0,SHAPE=B88),SQRT(J95^2+J93^2),0)","v":0},null,null,null,null,null,null,null,"A77A",{"$f":"IF(SHAPE=$B$80,4,0)","v":0},{"$f":"IF(S96>0,\"Glass Radius:\",0)","v":0},{"$f":"IF(S96>0,I85,0)","v":0},null,null,null,null,null,null,null,null,null,null,null,null,null,null,null,null,null,null,null,null,"A77Y",1,null,null,null,null,"A125",{"$f":"$J$151","v":0},{"$f":"$J$152","v":0},0]
[null,null,null,null,null,null,null,null,"Major Radius:",{"$f":"IF(AND(SHAPEW>0,SHAPEH>0,OFFSET>0,SHAPE=B88),K89+(SHAPEH/2),0)","v":0},null,null,null,null,null,null,null,"A77A",{"$f":"IF(SHAPE=$B$80,5,0)","v":0},{"$f":"IF(S97>0,\"Glass Width:\",0)","v":0},{"$f":"IF(S97>0,I82,0)","v":0},{"$f":"IF(AND(U97>0,U97<GlassMinW),1,0)","v":0},null,null,null,null,null,null,null,null,null,null,null,null,null,null,null,null,null,null,null,"A77Z",1,null,null,null,null,"A126",{"$f":"$J$162","v":0},{"$f":"$J$159","v":0},0]
[null,null,null,null,null,null,null,null,null,null,null,null,null,null,null,null,null,"A77A",{"$f":"IF(SHAPE=$B$80,6,0)","v":0},{"$f":"IF(S98>0,\"Glass Height:\",0)","v":0},{"$f":"IF(S98>0,I83,0)","v":0},{"$f":"IF(AND(U98>0,U98<GlassMinH),1,0)","v":0},null,null,null,null,null,null,null,null,null,null,null,null,null,null,null,null,null,null,null,"A78V",1,null,null,null,null,"A127",{"$f":"$K$261","v":0},{"$f":"$K$262","v":0},0]
[null,null,null,null,null,null,null,null,null,null,null,null,null,null,null,null,null,"A77A",{"$f":"IF(SHAPE=$B$80,7,0)","v":0},{"$f":"IF(S99>0,\"Max Width:\",0)","v":0},{"$f":"IF(S99>0,D81,0)","v":0},{"$f":"IF(AND(S99>0,SHAPEW>0,SHAPEW>U99),1,0)","v":0},null,null,null,null,null,null,null,null,null,null,null,null,null,null,null,null,null,null,null,"A78W",1,null,null,null,null,"A128",{"$f":"$K$273","v":0},{"$f":"$K$274","v":0},0]
[null,{"$f":"IF(SHAPESELECT=70,\"A77H\",IF(SHAPESELECT=80,\"A78H\",IF(SHAPESELECT=90,\"A79H\",\"\")))","v":"A77H"},"Min Angle","Max Cut","Max W","Max H","Min Side","Max UI",null,"peak angle",{"$f":"IF(AND(SHAPEW>0,SHAPEH>0,DIM_3>0,OFFSET>0,SHAPE=B100),DEGREES(ATAN(((SHAPEW-DIM_3)/2)/SHAPEH)),0)","v":0},{"$f":"IF(AND(SHAPEW>0,SHAPEH>0,OFFSET>0,DIM_3>0,SHAPE=B100),ROUND((12/TAN(RADIANS(K100))),1)&\" /12\",0)","v":0},null,null,null,null,null,"A77A",{"$f":"IF(SHAPE=$B$80,8,0)","v":0},{"$f":"IF(S100>0,\"Max UI:\",0)","v":0},{"$f":"IF(S100>0,E81,0)","v":0},{"$f":"IF(AND(S100>0,E82>0),1,0)","v":0},null,null,null,null,null,null,null,null,null,null,null,null,null,null,null,null,null,null,null,"A78Y",1,null,null,null,null,"A129",{"$f":"$J$172","v":0},{"$f":"$J$173","v":0},0]
[null,{"$f":"EXT","v":1},{"$f":"MINANGLE","v":0},{"$f":"MAXCUT","v":0},{"$f":"MAX_W","v":0},{"$f":"MAX_H","v":0},{"$f":"MINLEG","v":0},{"$f":"MAX_UI","v":0},null,"Bott Corner Cut Length",{"$f":"IF(AND(SHAPEW>0,SHAPEH>0,OFFSET>0,DIM_3>0,SHAPE=B100),OFFSET/SIN(RADIANS(K103)),0)","v":0},null,null,null,null,null,null,{"$f":"$B$88","v":"A77D"},{"$f":"IF(SHAPE=$B$88,1,0)","v":0},{"$f":"IF(S101>0,\"Frame Major R:\",0)","v":0},{"$f":"IF(S101>0,J97,0)","v":0},{"$f":"IF(AND(S101>0,SHAPEW>0,SHAPEH>0,J97<C89),1,0)","v":0},null,null,null,null,null,null,null,null,null,null,null,null,null,null,null,null,null,null,null,"A78Z",1,null,null,null,null,"A130",{"$f":"$J$182","v":0},{"$f":"$J$183","v":0},0]
[null,null,{"$f":"IF(AND(SHAPEW>0,SHAPE=B100,OR(K100<C101,K103<C101)),1,0)","v":0},{"$f":"IF(AND(SHAPEW>0,SHAPEH>0,SHAPE=B100,OR(K101>D101,K102>D101)),1,0)","v":0},{"$f":"IF(AND(SHAPEW>0,OFFSET>0,SHAPE=B100,SHAPEW>E101),1,0)","v":0},{"$f":"IF(AND(SHAPEH>0,OFFSET>0,SHAPE=B100,SHAPEH>F101),1,0)","v":0},{"$f":"IF(AND(SHAPEW>0,DIM_3>0,SHAPE=B100,OR(DIM_3<G101,K104<G101)),1,0)","v":0},{"$f":"IF(AND(SHAPEW>0,SHAPEH>0,OFFSET>0,SHAPE=B100,(SHAPEW+SHAPEH)>H101),1,0)","v":0},null,"Peak Cut Length",{"$f":"IF(AND(SHAPEW>0,SHAPEH>0,OFFSET>0,DIM_3>0,SHAPE=B100),OFFSET/COS((ASIN(SHAPEH/K104))/2),0)","v":0},null,null,null,null,null,null,"A77D",{"$f":"IF(SHAPE=$B$88,2,0)","v":0},{"$f":"IF(S102>0,\"Frame Minor R:\",0)","v":0},{"$f":"IF(S102>0,J96,0)","v":0},{"$f":"IF(AND(S102>0,SHAPEW>0,SHAPEH>0,J96<C89),1,0)","v":0},null,null,null,null,null,null,null,null,null,null,null,null,null,null,null,null,null,null,null,"A79V",1,null,null,null,null,"A131",{"$f":"$J$285","v":0},{"$f":"$J$286","v":0},0]
[null,null,{"$f":"MAX(C102:H102)","v":0},{"$f":"IF(AND(SHAPE=B100,C103=1),1,0)","v":0},null,{"$f":"IF(AND(SHAPE=B100,K105>0,K105<GlassMinW),\"Glass Width is Under Minimum\",IF(AND(SHAPE=B100,K106>0,K106<GlassMinH),\"Glass Height is Under Minimum\",\"\"))","v":""},null,null,null,"Bott Corner Angles",{"$f":"IF(AND(SHAPEW>0,SHAPEH>0,OFFSET>0,DIM_3>0,SHAPE=B100),((90-K100)/2),0)","v":0},null,null,null,null,null,null,"A77D",{"$f":"IF(SHAPE=$B$88,3,0)","v":0},{"$f":"IF(S103>0,\"Arc Length:\",0)","v":0},{"$f":"IF(S103>0,D96,0)","v":0},{"$f":"IF(AND(S103>0,SHAPEW>0,SHAPEH>0,D96>157),1,0)","v":{"$error":"#DIV/0!"}},null,null,null,null,null,null,null,null,null,null,null,null,null,null,null,null,null,null,null,"A79W",1,null,null,null,null,"A132",{"$f":"$K$193","v":0},{"$f":"$K$194","v":0},0]
[null,null,null,null,null,null,null,null,null,"Slanted leg Length",{"$f":"IF(AND(SHAPEW>0,SHAPEH>0,OFFSET>0,DIM_3>0,SHAPE=B100),SQRT(((SHAPEW-DIM_3)/2)^2+SHAPEH^2),0)","v":0},null,null,null,null,null,null,"A77D",{"$f":"IF(SHAPE=$B$88,4,0)","v":0},{"$f":"IF(S104>0,\"Glass Major R:\",0)","v":0},{"$f":"IF(S104>0,J97-OFFSET,0)","v":0},null,null,null,null,null,null,null,null,null,null,null,null,null,null,null,null,null,null,null,null,"A79Y",1,null,null,null,null,{"$f":"SHAPE","v":"Select"},{"$f":"IF(AND(SHAPELINK>1,SHAPEW>0),VLOOKUP(SHAPE,GLASSCHART,2,FALSE),0)","v":0},{"$f":"IF(AND(SHAPELINK>1,SHAPEW>0),VLOOKUP(SHAPE,GLASSCHART,3,FALSE),0)","v":0},{"$f":"IF(AND(SHAPELINK>1,SHAPEW>0),VLOOKUP(SHAPE,GLASSCHART,4,FALSE),0)","v":0}]
[null,null,null,null,null,null,null,null,null,"Glass Width:",{"$f":"IF(AND(SHAPEW>0,SHAPEH>0,OFFSET>0,DIM_3>0,SHAPE=B100),SHAPEW-(2*(SQRT(K101^2-OFFSET^2))),0)","v":0},null,null,null,null,null,null,"A77D",{"$f":"IF(SHAPE=$B$88,5,0)","v":0},{"$f":"IF(S105>0,\"Glass Minor R:\",0)","v":0},{"$f":"IF(S105>0,J96-OFFSET,0)","v":0},null,null,null,null,null,null,null,null,null,null,null,null,null,null,null,null,null,null,null,null,"A79Z",1]
[null,null,null,null,null,null,null,null,null,"Glass Height:",{"$f":"IF(AND(SHAPEW>0,SHAPEH>0,OFFSET>0,DIM_3>0,SHAPE=B100),SHAPEH-(2*OFFSET),0)","v":0},null,null,null,null,null,null,"A77D",{"$f":"IF(SHAPE=$B$88,6,0)","v":0},{"$f":"IF(S106>0,\"Glass Width:\",0)","v":0},{"$f":"IF(AND(S106>0,SHAPEW>0,SHAPEH>0),SHAPEW-(OFFSET*2),0)","v":0},{"$f":"IF(AND(U106>0,U106<GlassMinW),1,0)","v":0},null,null,null,null,null,null,null,null,null,null,null,null,null,null,null,null,null,null,null,"A116",1]
[null,null,null,null,null,null,null,null,null,"Glass Dim3:",{"$f":"IF(AND(SHAPEW>0,SHAPEH>0,OFFSET>0,DIM_3>0,SHAPE=B100),DIM_3-((SQRT(K102^2-OFFSET^2))*2),0)","v":0},null,null,null,null,null,null,"A77D",{"$f":"IF(SHAPE=$B$88,7,0)","v":0},{"$f":"IF(S107>0,\"Glass Height:\",0)","v":0},{"$f":"IF(AND(S107>0,SHAPEW>0,SHAPEH>0),SHAPEH-(OFFSET*2),0)","v":0},{"$f":"IF(AND(U107>0,U107<GlassMinH),1,0)","v":0},null,null,null,null,null,null,null,null,null,null,null,null,null,null,null,null,null,null,null,"A114",1,null,null,null,null,"Model","Width","Height","Area"]
[null,null,null,null,null,null,null,null,null,"Glass Slant Leg:",{"$f":"IF(AND(SHAPEW>0,SHAPEH>0,OFFSET>0,DIM_3>0,SHAPE=B100),K104-((SQRT(K101^2-OFFSET^2))+(SQRT(K102^2-OFFSET^2))),0)","v":0},null,null,null,null,null,null,"A77D",{"$f":"IF(SHAPE=$B$88,8,0)","v":0},{"$f":"IF(S108>0,\"Max Width:\",0)","v":0},{"$f":"IF(S108>0,D89,0)","v":0},{"$f":"IF(AND(S108>0,SHAPEW>0,SHAPEW>U108),1,0)","v":0},null,null,null,null,null,null,null,null,null,null,null,null,null,null,null,null,null,null,null,"A125",1,null,null,null,1,"Select"]
[null,null,null,null,null,null,null,null,null,null,null,null,null,null,null,null,null,"A77D",{"$f":"IF(SHAPE=$B$88,9,0)","v":0},{"$f":"IF(S109>0,\"Max Height:\",0)","v":0},{"$f":"IF(S109>0,E89,0)","v":0},{"$f":"IF(AND(S109>0,SHAPEH>0,SHAPEH>U109),1,0)","v":0},null,null,null,null,null,null,null,null,null,null,null,null,null,null,null,null,null,null,null,"A128",1,null,null,null,2,"A280",{"$f":"IF(AND(SHAPEW>0,SHAPEH>0),SHAPEW-2.5,0)","v":0},{"$f":"IF(AND(SHAPEW>0,SHAPEH>0),SHAPEH-2.5,0)","v":0},{"$f":"(AW109*AX109)/144","v":0}]
[null,null,null,null,null,null,null,null,null,null,null,null,null,null,null,null,null,"A77D",{"$f":"IF(SHAPE=$B$88,10,0)","v":0},{"$f":"IF(S110>0,\"Max UI:\",0)","v":0},{"$f":"IF(S110>0,F89,0)","v":0},{"$f":"IF(AND(S110>0,F90>0),1,0)","v":0},null,null,null,null,null,null,null,null,null,null,null,null,null,null,null,null,null,null,null,null,{"$f":"IF(ISERROR(VLOOKUP(SHAPE,AP94:AQ109,2,FALSE)),0,IF(SHAPELINK>1,VLOOKUP(SHAPE,AP94:AQ109,2,FALSE),0))","v":0},null,null,null,3,"A580",{"$f":"IF(AND(SHAPEW>0,SHAPEH>0),SHAPEW-2.5,0)","v":0},{"$f":"IF(AND(SHAPEW>0,SHAPEH>0),SHAPEH-2.5,0)","v":0},{"$f":"(AW110*AX110)/144","v":0}]
[null,{"$f":"IF(SHAPESELECT=70,\"A77J\",IF(SHAPESELECT=80,\"A78J\",IF(SHAPESELECT=90,\"A79J\",\"\")))","v":"A77J"},"Min Angle","Max Cut","Max W","Max H","Min Side","Max UI",null,"Slanted Angle",{"$f":"IF(AND(SHAPEW>0,SHAPEH>0,DIM_3>0,OFFSET>0,SHAPE=B111),(90-(DEGREES(ATAN((SHAPEW-DIM_3)/SHAPEH))))/2,0)","v":0},{"$f":"IF(AND(SHAPEW>0,SHAPEH>0,OFFSET>0,DIM_3>0,SHAPE=B111),ROUND((12*TAN(RADIANS(K111*2))),1)&\" /12\",0)","v":0},null,null,null,null,null,{"$f":"$B$100","v":"A77H"},{"$f":"IF(SHAPE=$B$100,1,0)","v":0},{"$f":"IF(S111>0,\"Roof Pitch:\",0)","v":0},{"$f":"IF(S111>0,L100,0)","v":0},null,null,null,null,null,null,null,null,null,null,null,null,null,null,null,null,null,null,null,null,null,null,null,null,null,4,"A780",{"$f":"IF(AND(SHAPEW>0,SHAPEH>0),SHAPEW-2.5,0)","v":0},{"$f":"IF(AND(SHAPEW>0,SHAPEH>0),SHAPEH-2.5,0)","v":0},{"$f":"(AW111*AX111)/144","v":0}]
[null,{"$f":"EXT","v":1},{"$f":"MINANGLE","v":0},{"$f":"MAXCUT","v":0},{"$f":"MAX_W","v":0},{"$f":"MAX_H","v":0},{"$f":"MINLEG","v":0},{"$f":"MAX_UI","v":0},null,"Bott Corner Cut Length",{"$f":"IF(AND(SHAPEW>0,SHAPEH>0,OFFSET>0,DIM_3>0,SHAPE=B111),OFFSET/SIN(RADIANS(K111)),0)","v":0},null,null,null,null,null,null,"A77H",{"$f":"IF(SHAPE=$B$100,2,0)","v":0},{"$f":"IF(S112>0,\"Horizontal Leg:\",0)","v":0},{"$f":"IF(AND(S112>0,DIM_3>0),DIM_3,0)","v":0},{"$f":"IF(AND(S112>0,DIM_3<G101),1,0)","v":0},null,null,null,null,null,null,null,null,null,null,null,null,null,null,null,null,null,null,null,null,null,null,null,null,5,"A680 Vent Wrap",{"$f":"IF(AND(SHAPEW>0,SHAPEH>0),SHAPEW-5.5625,0)","v":0},{"$f":"IF(AND(SHAPEW>0,SHAPEH>0),SHAPEH-5.5625,0)","v":0},{"$f":"(AW112*AX112)/144","v":0}]
[null,null,{"$f":"IF(AND(SHAPEW>0,SHAPE=B111,K111<C112),1,0)","v":0},{"$f":"IF(AND(SHAPEW>0,SHAPEH>0,SHAPE=B111,OR(K112>D112,K113>D112,K114>D112)),1,0)","v":0},{"$f":"IF(AND(SHAPEW>0,OFFSET>0,SHAPE=B111,SHAPEW>E112),1,0)","v":0},{"$f":"IF(AND(SHAPEH>0,OFFSET>0,SHAPE=B111,SHAPEH>F112),1,0)","v":0},{"$f":"IF(AND(SHAPEW>0,DIM_3>0,SHAPE=B111,OR(DIM_3<G112,K115<G112)),1,0)","v":0},{"$f":"IF(AND(SHAPEW>0,SHAPEH>0,OFFSET>0,SHAPE=B111,(SHAPEW+SHAPEH)>H112),1,0)","v":0},null,"Peak Cut Length",{"$f":"IF(AND(SHAPEW>0,SHAPEH>0,OFFSET>0,DIM_3>0,SHAPE=B111),OFFSET/COS(RADIANS(K111)),0)","v":0},null,null,null,null,null,null,"A77H",{"$f":"IF(SHAPE=$B$100,3,0)","v":0},{"$f":"IF(S113>0,\"Slanted Leg:\",0)","v":0},{"$f":"IF(S113>0,K104,0)","v":0},{"$f":"IF(AND(S113>0,K104<G101),1,0)","v":0},null,null,null,null,null,null,null,null,null,null,null,null,null,null,null,null,null,null,null,null,null,null,null,null,1,{"$f":"VLOOKUP(PWSELECT,PWTABLE,2,FALSE)","v":"Select"},{"$f":"IF(AND(PWSELECT>1,SHAPEW>0,SHAPEH>0),VLOOKUP(PWSELECT,PWTABLE,3,FALSE),0)","v":0},{"$f":"IF(AND(PWSELECT>1,SHAPEW>0,SHAPEH>0),VLOOKUP(PWSELECT,PWTABLE,4,FALSE),0)","v":0},{"$f":"IF(AND(PWSELECT>1,SHAPEW>0,SHAPEH>0),VLOOKUP(PWSELECT,PWTABLE,5,FALSE),0)","v":0},{"$f":"(AY113*2.408)*3","v":0}]
[null,null,{"$f":"MAX(C113:H113)","v":0},{"$f":"IF(AND(SHAPE=B111,C114=1),1,0)","v":0},null,{"$f":"IF(AND(SHAPE=B111,K116>0,K116<GlassMinW),\"Glass Width is Under Minimum\",IF(AND(SHAPE=B111,K117>0,K117<GlassMinH),\"Glass Height is Under Minimum\",\"\"))","v":""},null,null,null,"All 45O Cut L:",{"$f":"OFFSET/SIN(RADIANS(45))","v":0},null,null,null,null,null,null,"A77H",{"$f":"IF(SHAPE=$B$100,4,0)","v":0},{"$f":"IF(S114>0,\"Min Leg:\",0)","v":0},{"$f":"IF(S114>0,G101,0)","v":0},{"$f":"IF(AND(S114>0,G102>0),1,0)","v":0}]
[null,null,null,null,null,null,null,null,null,"Slanted leg Length",{"$f":"IF(AND(SHAPEW>0,SHAPEH>0,OFFSET>0,DIM_3>0,SHAPE=B111),SQRT((SHAPEW-DIM_3)^2+SHAPEH^2),0)","v":0},null,null,null,null,null,null,"A77H",{"$f":"IF(SHAPE=$B$100,5,0)","v":0},{"$f":"IF(S115>0,\"Peak Angle:\",0)","v":0},{"$f":"IF(S115>0,K100,0)","v":0},{"$f":"IF(AND(S115>0,C102>0,K100<C101),1,0)","v":0}]
[null,null,null,null,null,null,null,null,null,"Glass Width:",{"$f":"IF(AND(SHAPEW>0,SHAPEH>0,OFFSET>0,DIM_3>0,SHAPE=B111),SHAPEW-(OFFSET+SQRT(K112^2-OFFSET^2)),0)","v":0},null,null,null,null,null,null,"A77H",{"$f":"IF(SHAPE=$B$100,6,0)","v":0},{"$f":"IF(S116>0,\"Bott. Corner Cut L:\",0)","v":0},{"$f":"IF(S116>0,K101,0)","v":0},{"$f":"IF(AND(S116>0,D102>0,K101>D101),1,0)","v":0}]
[null,null,null,null,null,null,null,null,null,"Glass Height:",{"$f":"IF(AND(SHAPEW>0,SHAPEH>0,OFFSET>0,DIM_3>0,SHAPE=B111),SHAPEH-(2*OFFSET),0)","v":0},null,null,null,null,null,null,"A77H",{"$f":"IF(SHAPE=$B$100,7,0)","v":0},{"$f":"IF(S117>0,\"Bott. Corner Angles:\",0)","v":0},{"$f":"IF(S117>0,K103,0)","v":0},{"$f":"IF(AND(S117>0,C102>0,K103<C101),1,0)","v":0}]
[null,null,null,null,null,null,null,null,null,"Glass Dim3:",{"$f":"IF(AND(SHAPEW>0,SHAPEH>0,OFFSET>0,DIM_3>0,SHAPE=B111),DIM_3-(SQRT(K113^2-OFFSET^2)+OFFSET),0)","v":0},null,null,null,null,null,null,"A77H",{"$f":"IF(SHAPE=$B$100,8,0)","v":0},{"$f":"IF(S118>0,\"Peak Cut L:\",0)","v":0},{"$f":"IF(S118>0,K102,0)","v":0},{"$f":"IF(AND(S118>0,D102>0,K102>D101),1,0)","v":0}]
[null,null,null,null,null,null,null,null,null,"Glass Slant Leg:",{"$f":"IF(AND(SHAPEW>0,SHAPEH>0,OFFSET>0,DIM_3>0,SHAPE=B111),K115-((SQRT(K112^2-OFFSET^2))+(SQRT(K113^2-OFFSET^2))),0)","v":0},null,null,null,null,null,null,"A77H",{"$f":"IF(SHAPE=$B$100,9,0)","v":0},{"$f":"IF(S119>0,\"Glass Width:\",0)","v":0},{"$f":"IF(S119>0,K105,0)","v":0},{"$f":"IF(AND(U119>0,U119<GlassMinW),1,0)","v":0}]
[null,null,null,null,null,null,null,null,null,null,null,null,null,null,null,null,null,"A77H",{"$f":"IF(SHAPE=$B$100,10,0)","v":0},{"$f":"IF(S120>0,\"Glass Height:\",0)","v":0},{"$f":"IF(S120>0,K106,0)","v":0},{"$f":"IF(AND(U120>0,U120<GlassMinH),1,0)","v":0}]
[null,null,null,null,null,null,null,null,null,null,null,null,null,null,null,null,null,"A77H",{"$f":"IF(SHAPE=$B$100,11,0)","v":0},{"$f":"IF(S121>0,\"Glass Hor. Leg:\",0)","v":0},{"$f":"IF(S121>0,K107,0)","v":0}]
[null,{"$f":"IF(SHAPESELECT=70,\"A77G\",IF(SHAPESELECT=80,\"A78G\",IF(SHAPESELECT=90,\"A79G\",\"A122\")))","v":"A77G"},"Min Side","Max W","Max UI","Max sq.ft",null,"Leg Length",{"$f":"IF(AND(SHAPEW>0,OFFSET>0,SHAPE=B122),((TAN(22.5*(PI()/180)))*SHAPEW/2)*2,0)","v":0},null,null,null,null,null,null,null,null,"A77H",{"$f":"IF(SHAPE=$B$100,12,0)","v":0},{"$f":"IF(S122>0,\"Glass Slanted Leg:\",0)","v":0},{"$f":"IF(S122>0,K108,0)","v":0}]
[null,{"$f":"EXT","v":1},{"$f":"MINLEG","v":0},{"$f":"MAX_W","v":0},{"$f":"MAX_UI","v":0},{"$f":"MAXSF","v":0},null,"Frame H:",{"$f":"IF(AND(SHAPEW>0,OFFSET>0,SHAPE=B122),SHAPEW,0)","v":0},{"$f":"IF(SHAPEW<=SHAPEH,((TAN(22.5*(PI()/180)))*SHAPEW/2)*2,((TAN(22.5*(PI()/180)))*SHAPEH/2)*2)","v":0},null,null,null,null,null,null,null,"A77H",{"$f":"IF(SHAPE=$B$100,13,0)","v":0},{"$f":"IF(S123>0,\"Max Width:\",0)","v":0},{"$f":"IF(S123>0,E101,0)","v":0},{"$f":"IF(AND(S123>0,SHAPEW>0,SHAPEW>U123),1,0)","v":0}]
[null,null,{"$f":"IF(AND(SHAPEW>0,SHAPE=B122,I122<C123),1,0)","v":0},{"$f":"IF(AND(SHAPEW>0,OFFSET>0,SHAPE=B122,SHAPEW>D123),1,0)","v":0},{"$f":"IF(AND(SHAPEW>0,SHAPEH>0,OFFSET>0,SHAPE=B122,(SHAPEW+SHAPEH)>E123),1,0)","v":0},{"$f":"IF(AND(SHAPEW>0,SHAPEH>0,SHAPE=B122,((SHAPEW*SHAPEH)/144)>F123),1,0)","v":0},null,"Glass W:",{"$f":"IF(AND(SHAPEW>0,OFFSET>0,SHAPE=B122),SHAPEW-(OFFSET*2),0)","v":0},{"$f":"J123*SIN(RADIANS(45))","v":0},null,null,null,null,null,null,null,"A77H",{"$f":"IF(SHAPE=$B$100,14,0)","v":0},{"$f":"IF(S124>0,\"Max Height:\",0)","v":0},{"$f":"IF(S124>0,F101,0)","v":0},{"$f":"IF(AND(S124>0,SHAPEH>0,SHAPEH>U124),1,0)","v":0}]
[null,null,{"$f":"MAX(C124:F124)","v":0},{"$f":"IF(AND(SHAPE=B122,C125=1),1,0)","v":0},null,{"$f":"IF(AND(SHAPE=B122,SHAPEW>0,SHAPEH>0,SHAPEW<>SHAPEH),\"WIDTH AND HEIGHT MUST BE EQUAL\",IF(AND(SHAPE=B122,I124>0,I124<GlassMinW),\"Glass Width is Under Minimum\",IF(AND(SHAPE=B122,I125>0,I125<GlassMinH),\"Glass Height is Under Minimum\",\"\")))","v":""},null,"Glass H:",{"$f":"IF(AND(SHAPEW>0,OFFSET>0,SHAPE=B122),SHAPEW-(OFFSET*2),0)","v":0},{"$f":"IF(SHAPEH>SHAPEW,SHAPEH-(2*J124),SHAPEW-(2*J124))","v":0},null,null,null,null,null,null,null,"A77H",{"$f":"IF(SHAPE=$B$100,15,0)","v":0},{"$f":"IF(S125>0,\"Max UI:\",0)","v":0},{"$f":"IF(S125>0,H101,0)","v":0},{"$f":"IF(AND(S125>0,H102>0),1,0)","v":0}]
[null,null,null,null,null,null,null,"Glass Legs:",{"$f":"IF(AND(SHAPEW>0,OFFSET>0,SHAPE=B122),(((SHAPEW/2)-OFFSET)*TAN(RADIANS(22.5)))*2,0)","v":0},{"$f":"(DIM_3-J125)/2","v":0},null,null,null,null,null,null,null,{"$f":"$B$111","v":"A77J"},{"$f":"IF(SHAPE=$B$111,1,0)","v":0},{"$f":"IF(S126>0,\"Roof Pitch:\",0)","v":0},{"$f":"IF(S126>0,L111,0)","v":0}]
[null,null,null,null,null,null,null,null,null,{"$f":"J124-J126","v":0},null,null,null,null,null,null,null,"A77J",{"$f":"IF(SHAPE=$B$111,2,0)","v":0},{"$f":"IF(S127>0,\"Horizontal Leg:\",0)","v":0},{"$f":"IF(AND(S127>0,DIM_3>0),DIM_3,0)","v":0},{"$f":"IF(AND(S127>0,DIM_3<G112),1,0)","v":0}]
[null,null,null,null,null,null,null,null,null,{"$f":"SQRT(J124^2+J127^2)","v":0},null,null,null,null,null,null,null,"A77J",{"$f":"IF(SHAPE=$B$111,3,0)","v":0},{"$f":"IF(S128>0,\"Slanted Leg:\",0)","v":0},{"$f":"IF(S128>0,K115,0)","v":0},{"$f":"IF(AND(S128>0,K119<G112),1,0)","v":0}]
[null,null,null,null,null,null,null,null,null,null,null,null,null,null,null,null,null,"A77J",{"$f":"IF(SHAPE=$B$111,4,0)","v":0},{"$f":"IF(S129>0,\"Min Leg:\",0)","v":0},{"$f":"IF(S129>0,G112,0)","v":0},{"$f":"IF(AND(S129>0,G113>0),1,0)","v":0}]
[null,null,null,null,null,null,null,null,null,null,null,null,null,null,null,null,null,"A77J",{"$f":"IF(SHAPE=$B$111,5,0)","v":0},{"$f":"IF(S130>0,\"Slanted Angle:\",0)","v":0},{"$f":"IF(S130>0,K111,0)","v":0},{"$f":"IF(AND(S130>0,C113>0,K115<C112),1,0)","v":0}]
[null,{"$f":"IF(SHAPESELECT=70,\"A77Y\",IF(SHAPESELECT=80,\"A78Y\",IF(SHAPESELECT=90,\"A79Y\",\"\")))","v":"A77Y"},"Min Side","Max Cut","Max W","Max H","Max UI","Min Angle","Roof Pitch:",{"$f":"IF(AND(SHAPEH>0,SHAPEW>0,DIM_3>0,DIM_4>0,OFFSET>0,SHAPE=B131),90-DEGREES(ATAN((SHAPEH-DIM_3)/((SHAPEW-DIM_4)/2))),0)","v":0},{"$f":"IF(AND(SHAPEH>0,SHAPEW>0,DIM_3>0,DIM_4>0,OFFSET>0,SHAPE=B131),ROUND(12*(SHAPEH-DIM_3)/((SHAPEW-DIM_4)/2),1)&\" / 12\",0)","v":0},null,null,null,null,null,null,"A77J",{"$f":"IF(SHAPE=$B$111,6,0)","v":0},{"$f":"IF(S131>0,\"Bott. Corner Cut L:\",0)","v":0},{"$f":"IF(S131>0,K112,0)","v":0},{"$f":"IF(AND(S131>0,D113>0,K116>D112),1,0)","v":0}]
[null,{"$f":"EXT","v":1},{"$f":"MINLEG","v":0},{"$f":"MAXCUT","v":0},{"$f":"MAX_W","v":0},{"$f":"MAX_H","v":0},{"$f":"MAX_UI","v":0},{"$f":"MINANGLE","v":0},"Peak & Slant Cut:",{"$f":"IF(AND(SHAPEH>0,SHAPEW>0,DIM_3>0,DIM_4>0,OFFSET>0,SHAPE=B131),CUTOFFSET/COS(RADIANS((90-J131)/2)),0)","v":0},null,null,null,null,null,null,null,"A77J",{"$f":"IF(SHAPE=$B$111,7,0)","v":0},{"$f":"IF(S132>0,\"All 45O Cut L:\",0)","v":0},{"$f":"IF(S132>0,K114,0)","v":0},{"$f":"IF(AND(S132>0,D113>0,K114<D112),1,0)","v":0}]
[null,null,{"$f":"IF(AND(SHAPEW>0,SHAPEH>0,DIM_3>0,DIM_4>0,OFFSET>0,SHAPE=B131,OR(SHAPEW<C132,SHAPEH<C132,DIM_3<C132,DIM_4<C132,J138<C132)),1,0)","v":0},{"$f":"IF(AND(SHAPEW>0,SHAPEH>0,DIM_3>0,DIM_4>0,OFFSET>0,SHAPE=B131,OR(J132>D132,J133>D132,J134>D132,K132>D132,K133>D132,K134>D132)),1,0)","v":0},{"$f":"IF(AND(SHAPEW>0,OFFSET>0,SHAPE=B131,SHAPEW>E132),1,0)","v":0},{"$f":"IF(AND(SHAPEW>0,OFFSET>0,SHAPE=B131,SHAPEH>F132),1,0)","v":0},{"$f":"IF(AND(SHAPEW>0,SHAPEH>0,OFFSET>0,SHAPE=B131,(SHAPEW+SHAPEH)>G132),1,0)","v":0},{"$f":"IF(AND(SHAPEW>0,SHAPEH>0,DIM_3>0,DIM_4>0,SHAPE=B131,OR(J137<H132,J131<H132)),1,0)","v":0},"Vert & Slant Cut:",{"$f":"IF(AND(SHAPEH>0,SHAPEW>0,DIM_3>0,DIM_4>0,OFFSET>0,SHAPE=B131),CUTOFFSET/COS(RADIANS((J131/2))),0)","v":0},null,null,null,null,null,null,null,"A77J",{"$f":"IF(SHAPE=$B$111,8,0)","v":0},{"$f":"IF(S133>0,\"Peak Cut L:\",0)","v":0},{"$f":"IF(S133>0,K113,0)","v":0},{"$f":"IF(AND(S133>0,D113>0,K117>D112),1,0)","v":0}]
[null,null,{"$f":"MAX(C133:H133)","v":0},{"$f":"IF(AND(SHAPE=B131,C134=1),1,0)","v":0},null,null,{"$f":"IF(AND(SHAPE=B131,J139>0,J139<GlassMinW),\"Glass Width is Under Minimum\",IF(AND(SHAPE=B131,J140>0,J140<GlassMinH),\"Glass Height is Under Minimum\",\"\"))","v":""},null,"All 45O Cuts:",{"$f":"IF(AND(SHAPEH>0,SHAPEW>0,DIM_3>0,DIM_4>0,OFFSET>0,SHAPE=B131),CUTOFFSET/COS(RADIANS(45)),0)","v":0},null,null,null,null,null,null,null,"A77J",{"$f":"IF(SHAPE=$B$111,9,0)","v":0},{"$f":"IF(S134>0,\"Glass Width:\",0)","v":0},{"$f":"IF(S134>0,K116,0)","v":0},{"$f":"IF(AND(U134>0,U134<GlassMinW),1,0)","v":0}]
[null,null,null,null,null,null,null,null,"Glass Dim3:",{"$f":"IF(AND(SHAPEH>0,SHAPEW>0,DIM_3>0,DIM_4>0,OFFSET>0,SHAPE=B131),DIM_3-OFFSET-(SQRT(J133^2-OFFSET^2)),0)","v":0},null,null,null,null,null,null,null,"A77J",{"$f":"IF(SHAPE=$B$111,10,0)","v":0},{"$f":"IF(S135>0,\"Glass Height:\",0)","v":0},{"$f":"IF(S135>0,K117,0)","v":0},{"$f":"IF(AND(U135>0,U135<GlassMinH),1,0)","v":0}]
[null,null,null,null,null,null,null,null,"Glass Dim4:",{"$f":"IF(AND(SHAPEH>0,SHAPEW>0,DIM_3>0,DIM_4>0,OFFSET>0,SHAPE=B131),DIM_4-((SQRT(J132^2-OFFSET^2)*2)),0)","v":0},null,null,null,null,null,null,null,"A77J",{"$f":"IF(SHAPE=$B$111,11,0)","v":0},{"$f":"IF(S136>0,\"Glass Hor. Leg:\",0)","v":0},{"$f":"IF(S136>0,K118,0)","v":0}]
[null,null,null,null,null,null,null,null,"Angle @ Vert & Slant:",{"$f":"IF(AND(SHAPEH>0,SHAPEW>0,DIM_3>0,DIM_4>0,OFFSET>0,SHAPE=B131),DEGREES(ASIN(CUTOFFSET/J133)),0)","v":0},null,null,null,null,null,null,null,"A77J",{"$f":"IF(SHAPE=$B$111,12,0)","v":0},{"$f":"IF(S137>0,\"Glass Slanted Leg:\",0)","v":0},{"$f":"IF(S137>0,K119,0)","v":0}]
[null,null,null,null,null,null,null,null,"Slanted Leg:",{"$f":"IF(AND(SHAPEH>0,SHAPEW>0,DIM_3>0,DIM_4>0,OFFSET>0,SHAPE=B131),SQRT(((SHAPEW-DIM_4)/2)^2+(SHAPEH-DIM_3)^2),0)","v":0},null,null,null,null,null,null,null,"A77J",{"$f":"IF(SHAPE=$B$111,13,0)","v":0},{"$f":"IF(S138>0,\"Max Width:\",0)","v":0},{"$f":"IF(S138>0,E112,0)","v":0},{"$f":"IF(AND(S138>0,SHAPEW>0,SHAPEW>U138),1,0)","v":0}]
[null,null,null,null,null,null,null,null,"Glass Width:",{"$f":"IF(AND(SHAPEH>0,SHAPEW>0,DIM_3>0,DIM_4>0,OFFSET>0,SHAPE=B131),SHAPEW-(OFFSET*2),0)","v":0},null,null,null,null,null,null,null,"A77J",{"$f":"IF(SHAPE=$B$111,14,0)","v":0},{"$f":"IF(S139>0,\"Max Height:\",0)","v":0},{"$f":"IF(S139>0,F112,0)","v":0},{"$f":"IF(AND(S139>0,SHAPEH>0,SHAPEH>U139),1,0)","v":0}]
[null,null,null,null,null,null,null,null,"Glass Height:",{"$f":"IF(AND(SHAPEH>0,SHAPEW>0,DIM_3>0,DIM_4>0,OFFSET>0,SHAPE=B131),SHAPEH-(OFFSET*2),0)","v":0},null,null,null,null,null,null,null,"A77J",{"$f":"IF(SHAPE=$B$111,15,0)","v":0},{"$f":"IF(S140>0,\"Max UI:\",0)","v":0},{"$f":"IF(S140>0,H112,0)","v":0},{"$f":"IF(AND(S140>0,H113>0),1,0)","v":0}]
[null,null,null,null,null,null,null,null,null,null,null,null,null,null,null,null,null,{"$f":"$B$122","v":"A77G"},{"$f":"IF(SHAPE=$B$122,1,0)","v":0},{"$f":"IF(S141>0,\"Frame Height:\",0)","v":0},{"$f":"IF(S141>0,I123,0)","v":0}]
[null,null,null,null,null,null,null,null,null,null,null,null,null,null,null,null,null,"A77G",{"$f":"IF(SHAPE=$B$122,2,0)","v":0},{"$f":"IF(S142>0,\"Frame Leg:\",0)","v":0},{"$f":"IF(S142>0,I122,0)","v":0},{"$f":"IF(AND(S142>0,C124>0),1,0)","v":0}]
[null,{"$f":"IF(SHAPESELECT=70,\"A77Z\",IF(SHAPESELECT=80,\"A78Z\",IF(SHAPESELECT=90,\"A79Z\",\"A125\")))","v":"A77Z"},"Min Side","Max Cut","Max W","Max H","Max UI","Min Angle","Roof Pitch:",{"$f":"IF(AND(SHAPEH>0,SHAPEW>0,DIM_3>0,DIM_4>0,OFFSET>0,SHAPE=B143),90-DEGREES(ATAN((SHAPEH-DIM_3)/(SHAPEW-DIM_4))),0)","v":0},{"$f":"IF(AND(SHAPEH>0,SHAPEW>0,DIM_3>0,DIM_4>0,OFFSET>0,SHAPE=B143),ROUND((12*((SHAPEH-DIM_3)/(SHAPEW-DIM_4))),1)&\" / 12\",0)","v":0},null,null,null,null,null,null,"A77G",{"$f":"IF(SHAPE=$B$122,3,0)","v":0},{"$f":"IF(S143>0,\"Min. Leg:\",0)","v":0},{"$f":"IF(S143>0,C123,0)","v":0},{"$f":"IF(AND(S143>0,C124>0),1,0)","v":0}]
[null,{"$f":"EXT","v":1},{"$f":"MINLEG","v":0},{"$f":"MAXCUT","v":0},{"$f":"MAX_W","v":0},{"$f":"MAX_H","v":0},{"$f":"MAX_UI","v":0},{"$f":"MINANGLE","v":0},"Peak & Slant Cut:",{"$f":"IF(AND(SHAPEH>0,SHAPEW>0,DIM_3>0,DIM_4>0,OFFSET>0,SHAPE=B143),CUTOFFSET/COS(RADIANS((90-J143)/2)),0)","v":0},null,null,null,null,null,null,null,"A77G",{"$f":"IF(SHAPE=$B$122,4,0)","v":0},{"$f":"IF(S144>0,\"Glass Width:\",0)","v":0},{"$f":"IF(S144>0,I124,0)","v":0},{"$f":"IF(AND(U144>0,U144<GlassMinW),1,0)","v":0}]
[null,null,{"$f":"IF(AND(SHAPEW>0,SHAPEH>0,DIM_3>0,DIM_4>0,OFFSET>0,SHAPE=B143,OR(SHAPEW<C144,SHAPEH<C144,DIM_3<C144,DIM_4<C144,J150<C144)),1,0)","v":0},{"$f":"IF(AND(SHAPEW>0,SHAPEH>0,DIM_3>0,DIM_4>0,OFFSET>0,SHAPE=B143,OR(J144>D144,J145>D144,J146>D144,K144>D144,K145>D144,K146>D144)),1,0)","v":0},{"$f":"IF(AND(SHAPEW>0,OFFSET>0,SHAPE=B143,SHAPEW>E144),1,0)","v":0},{"$f":"IF(AND(SHAPEW>0,OFFSET>0,SHAPE=B143,SHAPEH>F144),1,0)","v":0},{"$f":"IF(AND(SHAPEW>0,SHAPEH>0,OFFSET>0,SHAPE=B143,(SHAPEW+SHAPEH)>G144),1,0)","v":0},{"$f":"IF(AND(SHAPEW>0,SHAPEH>0,DIM_3>0,DIM_4>0,SHAPE=B143,OR(J149<H144,J143<H144)),1,0)","v":0},"Vert & Slant Cut:",{"$f":"IF(AND(SHAPEH>0,SHAPEW>0,DIM_3>0,DIM_4>0,OFFSET>0,SHAPE=B143),CUTOFFSET/COS(RADIANS((J143/2))),0)","v":0},null,null,null,null,null,null,null,"A77G",{"$f":"IF(SHAPE=$B$122,5,0)","v":0},{"$f":"IF(S145>0,\"Glass Height:\",0)","v":0},{"$f":"IF(S145>0,I125,0)","v":0},{"$f":"IF(AND(U145>0,U145<GlassMinH),1,0)","v":0}]
[null,null,{"$f":"MAX(C145:H145)","v":0},{"$f":"IF(AND(SHAPE=B143,C146=1),1,0)","v":0},null,null,{"$f":"IF(AND(SHAPE=B143,J151>0,J151<GlassMinW),\"Glass Width is Under Minimum\",IF(AND(SHAPE=B143,J152>0,J152<GlassMinH),\"Glass Height is Under Minimum\",\"\"))","v":""},null,"All 45O Cuts:",{"$f":"IF(AND(SHAPEH>0,SHAPEW>0,DIM_3>0,DIM_4>0,OFFSET>0,SHAPE=B143),CUTOFFSET/COS(RADIANS(45)),0)","v":0},null,null,null,null,null,null,null,"A77G",{"$f":"IF(SHAPE=$B$122,6,0)","v":0},{"$f":"IF(S146>0,\"Glass Leg:\",0)","v":0},{"$f":"IF(S146>0,I126,0)","v":0}]
[null,null,null,null,null,null,null,null,"Glass Dim3:",{"$f":"IF(AND(SHAPEH>0,SHAPEW>0,DIM_3>0,DIM_4>0,OFFSET>0,SHAPE=B143),DIM_3-OFFSET-(SQRT(J145^2-OFFSET^2)),0)","v":0},null,null,null,null,null,null,null,"A77G",{"$f":"IF(SHAPE=$B$122,7,0)","v":0},{"$f":"IF(S147>0,\"Max Width:\",0)","v":0},{"$f":"IF(S147>0,D123,0)","v":0},{"$f":"IF(AND(S147>0,SHAPEW>0,SHAPEW>U147),1,0)","v":0}]
[null,null,null,null,null,null,null,null,"Glass Dim4:",{"$f":"IF(AND(SHAPEH>0,SHAPEW>0,DIM_3>0,DIM_4>0,OFFSET>0,SHAPE=B143),DIM_4-OFFSET-(SQRT(J144^2-OFFSET^2)),0)","v":0},null,null,null,null,null,null,null,"A77G",{"$f":"IF(SHAPE=$B$122,8,0)","v":0},{"$f":"IF(S148>0,\"Max UI:\",0)","v":0},{"$f":"IF(S148>0,E123,0)","v":0},{"$f":"IF(AND(S148>0,E124>0),1,0)","v":0}]
[null,null,null,null,null,null,null,null,"Angle @ Vert & Slant:",{"$f":"IF(AND(SHAPEH>0,SHAPEW>0,DIM_3>0,DIM_4>0,OFFSET>0,SHAPE=B143),DEGREES(ASIN(CUTOFFSET/J145)),0)","v":0},null,null,null,null,null,null,null,{"$f":"$B$131","v":"A77Y"},{"$f":"IF(SHAPE=$B$131,1,0)","v":0},{"$f":"IF(S149>0,\"Roof Pitch:\",0)","v":0},{"$f":"IF(S149>0,K131,0)","v":0}]
[null,null,null,null,null,null,null,null,"Slanted Leg:",{"$f":"IF(AND(SHAPEH>0,SHAPEW>0,DIM_3>0,DIM_4>0,OFFSET>0,SHAPE=B143),SQRT((SHAPEW-DIM_4)^2+(SHAPEH-DIM_3)^2),0)","v":0},null,null,null,null,null,null,null,"A77Y",{"$f":"IF(SHAPE=$B$131,2,0)","v":0},{"$f":"IF(S150>0,\"Horizontal Leg:\",0)","v":0},{"$f":"IF(AND(S150>0,DIM_4>0),DIM_4,0)","v":0},{"$f":"IF(AND(S150>0,DIM_4>0,DIM_4<C129),1,0)","v":0}]
[null,null,null,null,null,null,null,null,"Glass Width:",{"$f":"IF(AND(SHAPEH>0,SHAPEW>0,DIM_3>0,DIM_4>0,OFFSET>0,SHAPE=B143),SHAPEW-(OFFSET*2),0)","v":0},null,null,null,null,null,null,null,"A77Y",{"$f":"IF(SHAPE=$B$131,3,0)","v":0},{"$f":"IF(S151>0,\"Slanted Leg:\",0)","v":0},{"$f":"IF(S151>0,J138,0)","v":0},{"$f":"IF(AND(S151>0,DIM_3>0,DIM_4>0,J138<C132),1,0)","v":0}]
[null,null,null,null,null,null,null,null,"Glass Height:",{"$f":"IF(AND(SHAPEH>0,SHAPEW>0,DIM_3>0,DIM_4>0,OFFSET>0,SHAPE=B143),SHAPEH-(OFFSET*2),0)","v":0},null,null,null,null,null,null,null,"A77Y",{"$f":"IF(SHAPE=$B$131,4,0)","v":0},{"$f":"IF(S152>0,\"Vertical Leg:\",0)","v":0},{"$f":"IF(AND(S152>0,DIM_3>0),DIM_3,0)","v":0},{"$f":"IF(AND(S152>0,DIM_3>0,DIM_3<C129),1,0)","v":0}]
[null,null,null,null,null,null,null,null,null,null,null,null,null,null,null,null,null,"A77Y",{"$f":"IF(SHAPE=$B$131,5,0)","v":0},{"$f":"IF(S153>0,\"Vert & Slant Angle:\",0)","v":0},{"$f":"IF(S153>0,J137,0)","v":0},{"$f":"IF(AND(S153>0,DIM_3>0,DIM_4>0,SHAPEW>0,SHAPEH>0,J134<G129),1,0)","v":0}]
[null,null,null,null,null,null,null,null,null,null,null,null,null,null,null,null,null,"A77Y",{"$f":"IF(SHAPE=$B$131,6,0)","v":0},{"$f":"IF(S154>0,\"Hor & Slant Angle:\",0)","v":0},{"$f":"IF(S154>0,J131,0)","v":0},{"$f":"IF(AND(S154>0,DIM_3>0,DIM_4>0,SHAPEW>0,SHAPEH>0,J128<G129),1,0)","v":0}]
[null,{"$f":"IF(SHAPESELECT=70,\"A77S\",IF(SHAPESELECT=80,\"A78S\",IF(SHAPESELECT=90,\"A79S\",\"A126\")))","v":"A77S"},"Min Side","Max Cut","Max W","Max H","Max UI","Min Angle","Roof Pitch:",{"$f":"IF(AND(SHAPEW>0,SHAPEH>0,DIM_3>0,OFFSET>0,SHAPE=B155),90-DEGREES(ATAN((SHAPEH-DIM_3)/(SHAPEW/2))),0)","v":0},{"$f":"IF(AND(SHAPEH>0,DIM_3>0,SHAPEW>0,OFFSET>0,SHAPE=B155),ROUND((12*((SHAPEH-DIM_3)/(SHAPEW/2))),1)&\" /12\",0)","v":0},null,null,null,null,null,null,"A77Y",{"$f":"IF(SHAPE=$B$131,7,0)","v":0},{"$f":"IF(S155>0,\"Vert & Slant Cut L:\",0)","v":0},{"$f":"IF(S155>0,J133,0)","v":0},{"$f":"IF(AND(S155>0,J130>D129),1,0)","v":0}]
[null,{"$f":"EXT","v":1},{"$f":"MINLEG","v":0},{"$f":"MAXCUT","v":0},{"$f":"MAX_W","v":0},{"$f":"MAX_H","v":0},{"$f":"MAX_UI","v":0},{"$f":"MINANGLE","v":0},"Cut L @ Peak:",{"$f":"IF(AND(SHAPEW>0,SHAPEH>0,OFFSET>0,DIM_3>0,SHAPE=B155),CUTOFFSET/(SIN(RADIANS(J155))),0)","v":0},null,null,null,null,null,null,null,"A77Y",{"$f":"IF(SHAPE=$B$131,8,0)","v":0},{"$f":"IF(S156>0,\"Hor & Slant Cut L:\",0)","v":0},{"$f":"IF(S156>0,J132,0)","v":0},{"$f":"IF(AND(S156>0,J129>D129),1,0)","v":0}]
[null,null,{"$f":"IF(AND(SHAPEW>0,SHAPEH>0,DIM_3>0,SHAPE=B155,OR(SHAPEW<C156,SHAPEH<C156,DIM_3<C156,J161<C156)),1,0)","v":0},{"$f":"IF(AND(SHAPEW>0,SHAPEH>0,DIM_3>0,SHAPE=B155,OR(J156>D156,J157>D156,J158>D156)),1,0)","v":0},{"$f":"IF(AND(SHAPEW>0,SHAPE=B155,OFFSET>0,SHAPEW>E156),1,0)","v":0},{"$f":"IF(AND(SHAPEW>0,SHAPE=B155,OFFSET>0,SHAPEH>F156),1,0)","v":0},{"$f":"IF(AND(SHAPEW>0,SHAPEH>0,SHAPE=B155,OFFSET>0,(SHAPEW+SHAPEH)>G156),1,0)","v":0},{"$f":"IF(AND(SHAPEW>0,SHAPEH>0,DIM_3>0,SHAPE=B155,J155<H156,J163<H156),1,0)","v":0},"Cut L @ Vert & Slant:",{"$f":"IF(AND(SHAPEW>0,SHAPEH>0,DIM_3>0,OFFSET>0,SHAPE=B155),CUTOFFSET/SIN(RADIANS((180-J155)/2)),0)","v":0},null,null,null,null,null,null,null,"A77Y",{"$f":"IF(SHAPE=$B$131,9,0)","v":0},{"$f":"IF(S157>0,\"Glass Width:\",0)","v":0},{"$f":"IF(S157>0,J139,0)","v":0},{"$f":"IF(AND(U157>0,U157<GlassMinW),1,0)","v":0}]
[null,null,{"$f":"MAX(C157:H157)","v":0},{"$f":"IF(AND(SHAPE=B155,C158=1),1,0)","v":0},null,null,{"$f":"IF(AND(SHAPE=B155,J162>0,J162<GlassMinW),\"Glass Width is Under Minimum\",IF(AND(SHAPE=B155,J159>0,J159<GlassMinH),\"Glass Height is Under Minimum\",\"\"))","v":""},null,"All 45O Cuts:",{"$f":"IF(AND(SHAPEW>0,SHAPEH>0,DIM_3>0,OFFSET>0,SHAPE=B155),CUTOFFSET/COS(RADIANS(45)),0)","v":0},null,null,null,null,null,null,null,"A77Y",{"$f":"IF(SHAPE=$B$131,10,0)","v":0},{"$f":"IF(S158>0,\"Glass Height:\",0)","v":0},{"$f":"IF(S158>0,J140,0)","v":0},{"$f":"IF(AND(U158>0,U158<GlassMinH),1,0)","v":0}]
[null,null,null,null,null,null,null,null,"Glass Height:",{"$f":"IF(AND(SHAPEW>0,SHAPEH>0,DIM_3>0,OFFSET>0,SHAPE=B155),SHAPEH-OFFSET-J156,0)","v":0},null,null,null,null,null,null,null,"A77Y",{"$f":"IF(SHAPE=$B$131,11,0)","v":0},{"$f":"IF(S159>0,\"Glass Hor. Leg:\",0)","v":0},{"$f":"IF(S159>0,J136,0)","v":0}]
[null,null,null,null,null,null,null,null,"Glass Leg Height:",{"$f":"IF(AND(SHAPEW>0,SHAPEH>0,DIM_3>0,OFFSET>0,SHAPE=B155),DIM_3-OFFSET-(SQRT(J157^2-OFFSET^2)),0)","v":0},null,null,null,null,null,null,null,"A77Y",{"$f":"IF(SHAPE=$B$131,12,0)","v":0},{"$f":"IF(S160>0,\"Glass Vert. Leg:\",0)","v":0},{"$f":"IF(S160>0,J135,0)","v":0}]
[null,null,null,null,null,null,null,null,"Slanted Leg:",{"$f":"IF(AND(SHAPEW>0,SHAPEH>0,DIM_3>0,OFFSET>0,SHAPE=B155),SQRT((SHAPEH-DIM_3)^2+(SHAPEW/2)^2),0)","v":0},null,null,null,null,null,null,null,"A77Y",{"$f":"IF(SHAPE=$B$131,13,0)","v":0},{"$f":"IF(S161>0,\"Max Width:\",0)","v":0},{"$f":"IF(S161>0,E132,0)","v":0},{"$f":"IF(AND(S161>0,SHAPEW>0,SHAPEW>U161),1,0)","v":0}]
[null,null,null,null,null,null,null,null,"Glass Width:",{"$f":"IF(AND(SHAPEW>0,SHAPEH>0,DIM_3>0,OFFSET>0,SHAPE=B155),SHAPEW-(OFFSET*2),0)","v":0},null,null,null,null,null,null,null,"A77Y",{"$f":"IF(SHAPE=$B$131,14,0)","v":0},{"$f":"IF(S162>0,\"Max Height:\",0)","v":0},{"$f":"IF(S162>0,F132,0)","v":0},{"$f":"IF(AND(S162>0,SHAPEH>0,SHAPEH>U162),1,0)","v":0}]
[null,null,null,null,null,null,null,null,"Angle @ Leg & Slant",{"$f":"IF(AND(SHAPEW>0,SHAPEH>0,DIM_3>0,OFFSET>0,SHAPE=B155),(180-J155)/2,0)","v":0},null,null,null,null,null,null,null,"A77Y",{"$f":"IF(SHAPE=$B$131,15,0)","v":0},{"$f":"IF(S163>0,\"Max UI:\",0)","v":0},{"$f":"IF(S163>0,G132,0)","v":0},{"$f":"IF(AND(S163>0,F130>0),1,0)","v":0}]
[null,null,null,null,null,null,null,null,null,null,null,null,null,null,null,null,null,{"$f":"$B$143","v":"A77Z"},{"$f":"IF(SHAPE=$B$143,1,0)","v":0},{"$f":"IF(S164>0,\"Roof Pitch:\",0)","v":0},{"$f":"IF(S164>0,K143,0)","v":0}]
[null,null,null,null,null,null,null,null,null,null,null,null,null,null,null,null,null,"A77Z",{"$f":"IF(SHAPE=$B$143,2,0)","v":0},{"$f":"IF(S165>0,\"Horizontal Leg:\",0)","v":0},{"$f":"IF(AND(S165>0,DIM_4>0),DIM_4,0)","v":0},{"$f":"IF(AND(S165>0,DIM_4>0,DIM_4<C144),1,0)","v":0}]
[null,null,null,null,null,null,null,null,null,null,null,null,null,null,null,null,null,"A77Z",{"$f":"IF(SHAPE=$B$143,3,0)","v":0},{"$f":"IF(S166>0,\"Slanted Leg:\",0)","v":0},{"$f":"IF(S166>0,J150,0)","v":0},{"$f":"IF(AND(S166>0,DIM_3>0,DIM_4>0,J150<C144),1,0)","v":0}]
[null,{"$f":"IF(SHAPESELECT=70,\"A77Q\",IF(SHAPESELECT=80,\"A78Q\",IF(SHAPESELECT=90,\"A79Q\",\"A129\")))","v":"A77Q"},"Min Side","Max Cut","Max W","Max H","Max UI","Min Angle","Roof Pitch:",{"$f":"IF(AND(SHAPEH>0,SHAPEW>0,DIM_3>0,OFFSET>0,SHAPE=B167),DEGREES(ATAN((SHAPEH-DIM_3)/SHAPEW)),0)","v":0},{"$f":"IF(AND(SHAPEH>0,DIM_3>0,SHAPEW>0,OFFSET>0,SHAPE=B167),ROUND((12*((SHAPEH-DIM_3)/SHAPEW)),1)&\" /12\",0)","v":0},null,null,null,null,null,null,"A77Z",{"$f":"IF(SHAPE=$B$143,4,0)","v":0},{"$f":"IF(S167>0,\"Vertical Leg:\",0)","v":0},{"$f":"IF(AND(S167>0,DIM_3>0),DIM_3,0)","v":0},{"$f":"IF(AND(S167>0,DIM_3>0,DIM_3<C144),1,0)","v":0}]
[null,{"$f":"EXT","v":1},{"$f":"MINLEG","v":0},{"$f":"MAXCUT","v":0},{"$f":"MAX_W","v":0},{"$f":"MAX_H","v":0},{"$f":"MAX_UI","v":0},{"$f":"MINANGLE","v":0},"Peak & Slant Cut:",{"$f":"IF(AND(SHAPEW>0,SHAPEH>0,OFFSET>0,DIM_3>0,SHAPE=B167),CUTOFFSET/SIN(RADIANS((90-J167)/2)),0)","v":0},{"$f":"IF(AND(SHAPEW>0,SHAPEH>0,OFFSET>0,DIM_3>0,SHAPE=B167),OFFSET/SIN(RADIANS((90-J167)/2)),0)","v":0},null,null,null,null,null,null,"A77Z",{"$f":"IF(SHAPE=$B$143,5,0)","v":0},{"$f":"IF(S168>0,\"Vert & Slant Angle:\",0)","v":0},{"$f":"IF(S168>0,J149,0)","v":0},{"$f":"IF(AND(S168>0,DIM_3>0,DIM_4>0,SHAPEW>0,SHAPEH>0,J149<H144),1,0)","v":0}]
[null,null,{"$f":"IF(AND(SHAPEW>0,SHAPEH>0,DIM_3>0,OFFSET>0,SHAPE=B167,OR(SHAPEW<C168,SHAPEH<C168,DIM_3<C168,J174<C168)),1,0)","v":0},{"$f":"IF(AND(SHAPEW>0,SHAPEH>0,DIM_3>0,OFFSET>0,SHAPE=B167,OR(J168>D168,J169>D168,J170>D168,K168>D168,K169>D168,K170>D168)),1,0)","v":0},{"$f":"IF(AND(SHAPEW>0,SHAPE=B167,OFFSET>0,SHAPEW>E168),1,0)","v":0},{"$f":"IF(AND(SHAPEW>0,SHAPE=B167,OFFSET>0,SHAPEH>F168),1,0)","v":0},{"$f":"IF(AND(SHAPEW>0,SHAPEH>0,SHAPE=B167,OFFSET>0,(SHAPEW+SHAPEH)>G168),1,0)","v":0},{"$f":"IF(AND(SHAPEW>0,SHAPEH>0,DIM_3>0,SHAPE=B167,J175<H168),1,0)","v":0},"Vert & Slant Cut:",{"$f":"IF(AND(SHAPEH>0,SHAPEW>0,DIM_3>0,OFFSET>0,SHAPE=B167),CUTOFFSET/COS(RADIANS(((90-J167)/2))),0)","v":0},{"$f":"IF(AND(SHAPEH>0,SHAPEW>0,DIM_3>0,OFFSET>0,SHAPE=B167),OFFSET/COS(RADIANS(((90-J167)/2))),0)","v":0},null,null,null,null,null,null,"A77Z",{"$f":"IF(SHAPE=$B$143,6,0)","v":0},{"$f":"IF(S169>0,\"Hor & Slant Angle:\",0)","v":0},{"$f":"IF(S169>0,J143,0)","v":0},{"$f":"IF(AND(S169>0,DIM_3>0,DIM_4>0,SHAPEW>0,SHAPEH>0,J143<H144),1,0)","v":0}]
[null,null,{"$f":"MAX(C169:G169)","v":0},{"$f":"IF(AND(SHAPE=B167,C170=1),1,0)","v":0},null,null,{"$f":"IF(AND(SHAPE=B167,J172>0,J172<GlassMinW),\"Glass Width is Under Minimum\",IF(AND(SHAPE=B167,J173>0,J173<GlassMinH),\"Glass Height is Under Minimum\",IF(AND(SHAPE=B167,SHAPEW>0,SHAPEH>0,J167<0),\"Angle can not be negative\",\"\")))","v":""},null,"All 45O Cuts:",{"$f":"IF(AND(SHAPEH>0,SHAPEW>0,DIM_3>0,OFFSET>0,SHAPE=B167),CUTOFFSET/COS(RADIANS(45)),0)","v":0},{"$f":"IF(AND(SHAPEH>0,SHAPEW>0,DIM_3>0,OFFSET>0,SHAPE=B167),OFFSET/COS(RADIANS(45)),0)","v":0},null,null,null,null,null,null,"A77Z",{"$f":"IF(SHAPE=$B$143,7,0)","v":0},{"$f":"IF(S170>0,\"Vert & Slant Cut L:\",0)","v":0},{"$f":"IF(S170>0,J145,0)","v":0},{"$f":"IF(AND(S170>0,J145>D144),1,0)","v":0}]
[null,null,null,null,null,null,null,null,"Glass Dim3:",{"$f":"IF(AND(SHAPEH>0,SHAPEW>0,DIM_3>0,OFFSET>0,SHAPE=B167),DIM_3-OFFSET-(SQRT(K169^2-OFFSET^2)),0)","v":0},null,null,null,null,null,null,null,"A77Z",{"$f":"IF(SHAPE=$B$143,8,0)","v":0},{"$f":"IF(S171>0,\"Hor & Slant Cut L:\",0)","v":0},{"$f":"IF(S171>0,J144,0)","v":0},{"$f":"IF(AND(S171>0,J144>D144),1,0)","v":0}]
[null,null,null,null,null,null,null,null,"Glass Width:",{"$f":"IF(AND(SHAPEH>0,SHAPEW>0,DIM_3>0,OFFSET>0,SHAPE=B167),SHAPEW-(OFFSET*2),0)","v":0},null,null,null,null,null,null,null,"A77Z",{"$f":"IF(SHAPE=$B$143,9,0)","v":0},{"$f":"IF(S172>0,\"Glass Width:\",0)","v":0},{"$f":"IF(S172>0,J151,0)","v":0},{"$f":"IF(AND(U172>0,U172<GlassMinW),1,0)","v":0}]
[null,null,null,null,null,null,null,null,"Glass Height:",{"$f":"IF(AND(SHAPEH>0,SHAPEW>0,DIM_3>0,OFFSET>0,SHAPE=B167),SHAPEH-OFFSET-(SQRT(K168^2-OFFSET^2)),0)","v":0},null,null,null,null,null,null,null,"A77Z",{"$f":"IF(SHAPE=$B$143,10,0)","v":0},{"$f":"IF(S173>0,\"Glass Height:\",0)","v":0},{"$f":"IF(S173>0,J152,0)","v":0},{"$f":"IF(AND(U173>0,U173<GlassMinH),1,0)","v":0}]
[null,null,null,null,null,null,null,null,"Slanted Leg:",{"$f":"IF(AND(SHAPEH>0,SHAPEW>0,DIM_3>0,OFFSET>0,SHAPE=B167),SQRT(SHAPEW^2+(SHAPEH-DIM_3)^2),0)","v":0},null,null,null,null,null,null,null,"A77Z",{"$f":"IF(SHAPE=$B$143,11,0)","v":0},{"$f":"IF(S174>0,\"Glass Hor. Leg:\",0)","v":0},{"$f":"IF(S174>0,J148,0)","v":0}]
[null,null,null,null,null,null,null,null,"Peak Cut Angle:",{"$f":"IF(AND(SHAPEH>0,SHAPEW>0,DIM_3>0,OFFSET>0,SHAPE=B167),DEGREES(ASIN(CUTOFFSET/J168)),0)","v":0},null,null,null,null,null,null,null,"A77Z",{"$f":"IF(SHAPE=$B$143,12,0)","v":0},{"$f":"IF(S175>0,\"Glass Vert. Leg:\",0)","v":0},{"$f":"IF(S175>0,J147,0)","v":0}]
[null,null,null,null,null,null,null,null,null,null,null,null,null,null,null,null,null,"A77Z",{"$f":"IF(SHAPE=$B$143,13,0)","v":0},{"$f":"IF(S176>0,\"Max Width:\",0)","v":0},{"$f":"IF(S176>0,E144,0)","v":0},{"$f":"IF(AND(S176>0,SHAPEW>0,SHAPEW>U176),1,0)","v":0}]
[null,null,null,null,null,null,null,null,null,null,null,null,null,null,null,null,null,"A77Z",{"$f":"IF(SHAPE=$B$143,14,0)","v":0},{"$f":"IF(S177>0,\"Max Height:\",0)","v":0},{"$f":"IF(S177>0,F144,0)","v":0},{"$f":"IF(AND(S177>0,SHAPEH>0,SHAPEH>U177),1,0)","v":0}]
[null,null,null,null,null,null,null,null,null,null,null,null,null,null,null,null,null,"A77Z",{"$f":"IF(SHAPE=$B$143,15,0)","v":0},{"$f":"IF(S178>0,\"Max UI:\",0)","v":0},{"$f":"IF(S178>0,G144,0)","v":0},{"$f":"IF(AND(S178>0,G145>0),1,0)","v":0}]
[null,{"$f":"IF(SHAPESELECT=70,\"A77P\",IF(SHAPESELECT=80,\"A78P\",IF(SHAPESELECT=90,\"A79P\",\"A130\")))","v":"A77P"},"Min Side","Max Cut","Max W","Max H","Max UI","Min Angle","Bottom Cut L:",{"$f":"IF(AND(SHAPEW>0,SHAPEH>0,OFFSET>0,SHAPE=B179),CUTOFFSET/(SIN(RADIANS((DEGREES(ATAN(SHAPEH/SHAPEW)))/2))),0)","v":0},{"$f":"IF(AND(SHAPEW>0,SHAPEH>0,OFFSET>0,SHAPE=B179),OFFSET/(SIN(RADIANS((DEGREES(ATAN(SHAPEH/SHAPEW)))/2))),0)","v":0},null,null,null,null,null,null,{"$f":"$B$155","v":"A77S"},{"$f":"IF(SHAPE=$B$155,1,0)","v":0},{"$f":"IF(S179>0,\"Roof Pitch:\",0)","v":0},{"$f":"IF(S179>0,K155,0)","v":0}]
[null,{"$f":"EXT","v":1},{"$f":"MINLEG","v":0},{"$f":"MAXCUT","v":0},{"$f":"MAX_W","v":0},{"$f":"MAX_H","v":0},{"$f":"MAX_UI","v":0},{"$f":"MINANGLE","v":0},"Top Cut Length:",{"$f":"IF(AND(SHAPEW>0,SHAPEH>0,OFFSET>0,SHAPE=B179),CUTOFFSET/(SIN(RADIANS((DEGREES(ATAN(SHAPEW/SHAPEH)))/2))),0)","v":0},{"$f":"IF(AND(SHAPEW>0,SHAPEH>0,OFFSET>0,SHAPE=B179),OFFSET/(SIN(RADIANS((DEGREES(ATAN(SHAPEW/SHAPEH)))/2))),0)","v":0},null,null,null,null,null,null,"A77S",{"$f":"IF(SHAPE=$B$155,2,0)","v":0},{"$f":"IF(S180>0,\"Slanted Leg:\",0)","v":0},{"$f":"IF(S180>0,J161,0)","v":0},{"$f":"IF(AND(S180>0,SHAPEW>0,SHAPEH>0,DIM_3>0,J161<C156),1,0)","v":0}]
[null,null,{"$f":"IF(AND(SHAPEW>0,SHAPEH>0,SHAPE=B179,OR(SHAPEW<C180,SHAPEH<C180)),1,0)","v":0},{"$f":"IF(AND(SHAPEW>0,SHAPEH>0,SHAPE=B179,OFFSET>0,OR(J179>D180,J180>D180,J181>D180)),1,0)","v":0},{"$f":"IF(AND(SHAPEW>0,SHAPEH>0,OFFSET>0,SHAPE=B179,SHAPEW>E180),1,0)","v":0},{"$f":"IF(AND(SHAPEW>0,SHAPEH>0,OFFSET>0,SHAPE=B179,SHAPEH>F180),1,0)","v":0},{"$f":"IF(AND(SHAPEW>0,SHAPEH>0,OFFSET>0,SHAPE=B179,(SHAPEW+SHAPEH)>G180),1,0)","v":0},{"$f":"IF(AND(SHAPEW>0,SHAPEH>0,OFFSET>0,SHAPE=B179,OR(J185<H180,J186<H180)),1,0)","v":0},"Corner Cut L:",{"$f":"IF(AND(SHAPEW>0,SHAPEH>0,OFFSET>0,SHAPE=B179),SQRT(CUTOFFSET^2+CUTOFFSET^2),0)","v":0},null,null,null,null,null,null,null,"A77S",{"$f":"IF(SHAPE=$B$155,3,0)","v":0},{"$f":"IF(S181>0,\"Vertical Leg:\",0)","v":0},{"$f":"IF(AND(S181>0,DIM_3>0),DIM_3,0)","v":0},{"$f":"IF(AND(S181>0,SHAPEW>0,SHAPEH>0,DIM_3>0,DIM_3<C156),1,0)","v":0}]
[null,null,{"$f":"MAX(C181:H181)","v":0},{"$f":"IF(AND(SHAPE=B179,C182=1),1,0)","v":0},null,null,{"$f":"IF(AND(SHAPE=B179,J182>0,J182<GlassMinW),\"Glass Width is Under Minimum\",IF(AND(SHAPE=B179,J183>0,J183<GlassMinH),\"Glass Height is Under Minimum\",\"\"))","v":""},null,"Glass Width:",{"$f":"IF(AND(SHAPEW>0,SHAPEH>0,OFFSET>0,SHAPE=B179),SHAPEW-OFFSET-(SQRT(K179^2-OFFSET^2)),0)","v":0},null,null,null,null,null,null,null,"A77S",{"$f":"IF(SHAPE=$B$155,4,0)","v":0},{"$f":"IF(S182>0,\"Leg & Slant Angle:\",0)","v":0},{"$f":"IF(S182>0,J163,0)","v":0},{"$f":"IF(AND(S182>0,SHAPEW>0,SHAPEH>0,DIM_3>0,J163<H156),1,0)","v":0}]
[null,null,null,null,null,null,null,null,"Glass Height:",{"$f":"IF(AND(SHAPEW>0,SHAPEH>0,OFFSET>0,SHAPE=B179),SHAPEH-OFFSET-(SQRT(K180^2-OFFSET^2)),0)","v":0},null,null,null,null,null,null,null,"A77S",{"$f":"IF(SHAPE=$B$155,5,0)","v":0},{"$f":"IF(S183>0,\"Leg & Slant Cut L:\",0)","v":0},{"$f":"IF(S183>0,J157,0)","v":0},{"$f":"IF(AND(S183>0,U183>D156),1,0)","v":0}]
[null,null,null,null,null,null,null,null,"Roof Pitch:",{"$f":"IF(AND(SHAPEW>0,SHAPEH>0,OFFSET>0,SHAPE=B179),DEGREES(ATAN(SHAPEH/SHAPEW)),0)","v":0},{"$f":"IF(AND(SHAPEW>0,SHAPEH>0,OFFSET>0,SHAPE=B179),ROUND((12*(TAN(RADIANS(J184)))),1)&\" /12\",0)","v":0},null,null,null,null,null,null,"A77S",{"$f":"IF(SHAPE=$B$155,6,0)","v":0},{"$f":"IF(S184>0,\"Peak Cut Length:\",0)","v":0},{"$f":"IF(S184>0,J156,0)","v":0},{"$f":"IF(AND(S184>0,U184>D156),1,0)","v":0}]
[null,null,null,null,null,null,null,null,"Peak Angle:",{"$f":"IF(AND(SHAPEW>0,SHAPEH>0,OFFSET>0,SHAPE=B179),(180-J184-90)/2,0)","v":0},null,null,null,null,null,null,null,"A77S",{"$f":"IF(SHAPE=$B$155,7,0)","v":0},{"$f":"IF(S185>0,\"Corner Cut L:\",0)","v":0},{"$f":"IF(S185>0,MAX(J158,K158),0)","v":0},{"$f":"IF(AND(S185>0,U185>D156),1,0)","v":0}]
[null,null,null,null,null,null,null,null,"Bott Corner Angle:",{"$f":"IF(AND(SHAPEW>0,SHAPEH>0,OFFSET>0,SHAPE=B179),J184/2,0)","v":0},null,null,null,null,null,null,null,"A77S",{"$f":"IF(SHAPE=$B$155,8,0)","v":0},{"$f":"IF(S186>0,\"Glass Width:\",0)","v":0},{"$f":"IF(S186>0,J162,0)","v":0},{"$f":"IF(AND(U186>0,U186<GlassMinW),1,0)","v":0}]
[null,null,null,null,null,null,null,null,null,null,null,null,null,null,null,null,null,"A77S",{"$f":"IF(SHAPE=$B$155,9,0)","v":0},{"$f":"IF(S187>0,\"Glass Height:\",0)","v":0},{"$f":"IF(S187>0,J159,0)","v":0},{"$f":"IF(AND(U187>0,U187<GlassMinH),1,0)","v":0}]
[null,null,null,null,null,null,null,null,null,null,null,null,null,null,null,null,null,"A77S",{"$f":"IF(SHAPE=$B$155,10,0)","v":0},{"$f":"IF(S188>0,\"Glass Leg:\",0)","v":0},{"$f":"IF(S188>0,J160,0)","v":0}]
[null,null,null,null,null,null,null,null,null,null,null,null,null,null,null,null,null,"A77S",{"$f":"IF(SHAPE=$B$155,11,0)","v":0},{"$f":"IF(S189>0,\"Max Width:\",0)","v":0},{"$f":"IF(S189>0,E156,0)","v":0},{"$f":"IF(AND(S189>0,SHAPEW>0,SHAPEW>U189),1,0)","v":0}]
[null,null,null,null,null,null,null,null,null,null,null,null,null,null,null,null,null,"A77S",{"$f":"IF(SHAPE=$B$155,12,0)","v":0},{"$f":"IF(S190>0,\"Max Height:\",0)","v":0},{"$f":"IF(S190>0,F156,0)","v":0},{"$f":"IF(AND(S190>0,SHAPEH>0,SHAPEH>U190),1,0)","v":0}]
[null,{"$f":"IF(SHAPESELECT=70,\"A77N\",IF(SHAPESELECT=80,\"A78N\",IF(SHAPESELECT=90,\"A79N\",\"A132\")))","v":"A77N"},"Min Side","Max Cut","Max W","Max H","Max UI","Min Angle","Min W","Bottom Cut L:",{"$f":"IF(AND(SHAPEW>0,SHAPEH>0,OFFSET>0,SHAPE=B191),CUTOFFSET/(SIN(RADIANS(K195/2))),0)","v":0},{"$f":"IF(AND(SHAPEW>0,SHAPEH>0,OFFSET>0,SHAPE=B191),OFFSET/(SIN(RADIANS(K195/2))),0)","v":0},null,null,null,null,null,"A77S",{"$f":"IF(SHAPE=$B$155,13,0)","v":0},{"$f":"IF(S191>0,\"Max UI:\",0)","v":0},{"$f":"IF(S191>0,G156,0)","v":0},{"$f":"IF(AND(S191>0,G157>0),1,0)","v":0}]
[null,{"$f":"EXT","v":1},{"$f":"MINLEG","v":0},{"$f":"MAXCUT","v":0},{"$f":"MAX_W","v":0},{"$f":"MAX_H","v":0},{"$f":"MAX_UI","v":0},{"$f":"MINANGLE","v":0},{"$f":"MIN_w","v":0},"Top Cut Length:",{"$f":"IF(AND(SHAPEW>0,SHAPEH>0,OFFSET>0,SHAPE=B191),CUTOFFSET/(SIN(RADIANS(K196/2))),0)","v":0},{"$f":"IF(AND(SHAPEW>0,SHAPEH>0,OFFSET>0,SHAPE=B191),OFFSET/(SIN(RADIANS(K196/2))),0)","v":0},null,null,null,null,null,{"$f":"$B$167","v":"A77Q"},{"$f":"IF(SHAPE=$B$167,1,0)","v":0},{"$f":"IF(S192>0,\"Roof Pitch:\",0)","v":0},{"$f":"IF(S192>0,K167,0)","v":0},{"$f":"IF(AND(SHAPE=B167,SHAPEW>0,SHAPEH>0,J167<0),1,0)","v":0}]
[null,null,{"$f":"IF(AND(SHAPEW>0,SHAPEH>0,OFFSET>0,SHAPE=B191,OR(SHAPEW<C192,K197<C192)),1,0)","v":0},{"$f":"IF(AND(SHAPEW>0,SHAPEH>0,OFFSET>0,SHAPE=B191,OR(K191>D192,K192>D192)),1,0)","v":0},{"$f":"IF(AND(SHAPEW>0,SHAPEH>0,OFFSET>0,SHAPE=B191,SHAPEW>E192),1,0)","v":0},{"$f":"IF(AND(SHAPEW>0,SHAPEH>0,OFFSET>0,SHAPE=B191,SHAPEH>F192),1,0)","v":0},{"$f":"IF(AND(SHAPEW>0,SHAPEH>0,OFFSET>0,SHAPE=B191,(SHAPEW+SHAPEH)>G192),1,0)","v":0},{"$f":"IF(AND(SHAPEW>0,SHAPEH>0,OFFSET>0,SHAPE=B191,OR(K195<H192,K196<H192)),1,0)","v":0},{"$f":"IF(AND(SHAPEW>0,SHAPEH>0,SHAPE=B191,OFFSET>0,SHAPEW<I192),1,0)","v":0},"Glass Width:",{"$f":"IF(AND(SHAPEW>0,SHAPEH>0,OFFSET>0,SHAPE=B191),SHAPEW-((SQRT(L191^2-OFFSET^2))*2),0)","v":0},{"$f":"IF(AND(SHAPEW>0,SHAPEH>0,OFFSET>0,SHAPE=B191),ROUND((12*(TAN(RADIANS(K195)))),1)&\" /12\",0)","v":0},"Roof Pitch",null,null,null,null,"A77Q",{"$f":"IF(SHAPE=$B$167,2,0)","v":0},{"$f":"IF(S193>0,\"Slanted Leg Length:\",0)","v":0},{"$f":"IF(S193>0,J174,0)","v":0}]
[null,null,{"$f":"MAX(C193:I193)","v":0},{"$f":"IF(AND(SHAPE=B191,C194=1),1,0)","v":0},null,null,{"$f":"IF(AND(SHAPE=B191,K193>0,K193<GlassMinW),\"Glass Width is Under Minimum\",IF(AND(SHAPE=B191,K194>0,K194<GlassMinH),\"Glass Height is Under Minimum\",\"\"))","v":""},null,null,"Glass Height:",{"$f":"IF(AND(SHAPEW>0,SHAPEH>0,OFFSET>0,SHAPE=B191),SHAPEH-OFFSET-L192,0)","v":0},null,null,null,null,null,null,"A77Q",{"$f":"IF(SHAPE=$B$167,3,0)","v":0},{"$f":"IF(S194>0,\"Peak Cut Angle:\",0)","v":0},{"$f":"IF(S194>0,J175,0)","v":0},{"$f":"IF(AND(S194>0,H169>0),1,0)","v":0}]
[null,null,null,null,null,null,null,null,null,"Bottom Angles:",{"$f":"IF(AND(SHAPEW>0,SHAPEH>0,OFFSET>0,SHAPE=B191),DEGREES(ATAN(SHAPEH/(SHAPEW/2))),0)","v":0},null,null,null,null,null,null,"A77Q",{"$f":"IF(SHAPE=$B$167,4,0)","v":0},{"$f":"IF(S195>0,\"Peak Cut Length:\",0)","v":0},{"$f":"IF(S195>0,MAX(J168,K168),0)","v":0},{"$f":"IF(AND(S195>0,U195>D168),1,0)","v":0}]
[null,null,null,null,null,null,null,null,null,"Peak Angle:",{"$f":"IF(AND(SHAPEW>0,SHAPEH>0,OFFSET>0,SHAPE=B191),180-(K195*2),0)","v":0},null,null,null,null,null,null,"A77Q",{"$f":"IF(SHAPE=$B$167,5,0)","v":0},{"$f":"IF(S196>0,\"Leg & Slant Cut L:\",0)","v":0},{"$f":"IF(S196>0,MAX(J169,K169),0)","v":0},{"$f":"IF(AND(S196>0,U196>D168),1,0)","v":0}]
[null,null,null,null,null,null,null,null,null,"Sides Length:",{"$f":"IF(AND(SHAPEW>0,SHAPEH>0,OFFSET>0,SHAPE=B191),SQRT(SHAPEH^2+(SHAPEW/2)^2),0)","v":0},null,null,null,null,null,null,"A77Q",{"$f":"IF(SHAPE=$B$167,6,0)","v":0},{"$f":"IF(S197>0,\"Corner Cut L:\",0)","v":0},{"$f":"IF(S197>0,MAX(J170,K170),0)","v":0},{"$f":"IF(AND(S197>0,U197>D168),1,0)","v":0}]
[null,null,null,null,null,null,null,null,null,null,null,null,null,null,null,null,null,"A77Q",{"$f":"IF(SHAPE=$B$167,7,0)","v":0},{"$f":"IF(S198>0,\"Glass Width:\",0)","v":0},{"$f":"IF(S198>0,J172,0)","v":0},{"$f":"IF(AND(U198>0,U198<GlassMinW),1,0)","v":0}]
[null,null,null,null,null,null,null,null,null,null,null,null,null,null,null,null,null,"A77Q",{"$f":"IF(SHAPE=$B$167,8,0)","v":0},{"$f":"IF(S199>0,\"Glass Height:\",0)","v":0},{"$f":"IF(S199>0,J173,0)","v":0},{"$f":"IF(AND(U199>0,U199<GlassMinH),1,0)","v":0}]
[null,null,null,null,null,null,null,null,null,null,null,null,null,null,null,null,null,"A77Q",{"$f":"IF(SHAPE=$B$167,9,0)","v":0},{"$f":"IF(S200>0,\"Glass Leg:\",0)","v":0},{"$f":"IF(S200>0,J171,0)","v":0}]
[null,null,null,null,null,null,null,null,null,null,null,null,null,null,null,null,null,"A77Q",{"$f":"IF(SHAPE=$B$167,10,0)","v":0},{"$f":"IF(S201>0,\"Min. Section:\",0)","v":0},{"$f":"IF(S201>0,C168,0)","v":0},{"$f":"IF(AND(SHAPEW>0,SHAPEH>0,U201>0,C169>0),1,0)","v":0}]
[null,null,null,null,null,null,null,null,null,null,null,null,null,null,null,null,null,"A77Q",{"$f":"IF(SHAPE=$B$167,11,0)","v":0},{"$f":"IF(S202>0,\"Max Width:\",0)","v":0},{"$f":"IF(S202>0,E168,0)","v":0},{"$f":"IF(AND(S202>0,SHAPEW>0,SHAPEW>U202),1,0)","v":0}]
[null,"A117","Min R","Max W","Max UI",null,null,"Point B from center:",{"$f":"IF(AND(SHAPEW>0,SHAPEH>0,OFFSET>0,SHAPE=$B$203),(SHAPEW/2)-I211,0)","v":0},{"$f":"IF(AND(SHAPEW>0,SHAPEH>0,OFFSET>0,SHAPE=$B$203),(SHAPEW/2)-I211,0)","v":0},null,null,null,null,null,null,null,"A77Q",{"$f":"IF(SHAPE=$B$167,12,0)","v":0},{"$f":"IF(S203>0,\"Max Height:\",0)","v":0},{"$f":"IF(S203>0,F168,0)","v":0},{"$f":"IF(AND(S203>0,SHAPEH>0,SHAPEH>U203),1,0)","v":0}]
[null,{"$f":"EXT","v":1},{"$f":"MINRADIUS","v":0},{"$f":"MAX_W","v":0},{"$f":"MAX_UI","v":0},null,null,"Edge to Peak:",{"$f":"IF(AND(SHAPEW>0,SHAPEH>0,OFFSET>0,SHAPE=$B$203),SQRT((SHAPEW/2)^2+SHAPEH^2),0)","v":0},{"$f":"IF(AND(SHAPEW>0,SHAPEH>0,SHAPE=$B$203,OFFSET>0),J203/TAN(I209),0)","v":0},null,null,null,null,null,null,null,"A77Q",{"$f":"IF(SHAPE=$B$167,13,0)","v":0},{"$f":"IF(S204>0,\"Max UI:\",0)","v":0},{"$f":"IF(S204>0,G168,0)","v":0},{"$f":"IF(AND(S204>0,G169>0),1,0)","v":0}]
[null,null,{"$f":"IF(AND(SHAPEW>0,SHAPEH>0,SHAPE=$B$203,OR(I211<C204,I212<C204)),1,0)","v":0},{"$f":"IF(AND(SHAPEW>0,OFFSET>0,SHAPE=$B$203,SHAPEW>D204),1,0)","v":0},{"$f":"IF(AND(SHAPEW>0,SHAPEH>0,OFFSET>0,SHAPE=$B$203,(SHAPEW+SHAPEH)>E204),1,0)","v":0},null,null,"Peak Radius:",{"$f":"IF(AND(SHAPEW>0,SHAPEH>0,OFFSET>0,SHAPE=$B$203),(SHAPEW/2)-SHAPEH,0)","v":0},null,null,null,null,null,null,null,null,{"$f":"$B$179","v":"A77P"},{"$f":"IF(SHAPE=$B$179,1,0)","v":0},{"$f":"IF(S205>0,\"Roof Pitch:\",0)","v":0},{"$f":"IF(S205>0,K184,0)","v":0}]
[null,null,{"$f":"MAX(C205:E205)","v":0},{"$f":"IF(AND(SHAPE=$B$203,C206=1),1,0)","v":0},{"$f":"IF(AND(SHAPEW>0,SHAPEH>0,OFFSET>0,SHAPE=$B$203,SHAPEH>=SHAPEW/2),1,0)","v":0},{"$f":"IF(AND(SHAPE=$B$203,SHAPEW>0,C205>0),\"RADIUS MUST BE GREATER THAN \"&C204,IF(AND(SHAPE=$B$203,J209>0,J209<GlassMinW),\"Glass Width is Under Minimum\",IF(AND(SHAPE=$B$203,J210>0,J210<GlassMinH),\"Glass Height is Under Minimum\",\"\")))","v":""},null,"Hyp. From left to peak:",{"$f":"IF(AND(SHAPEW>0,SHAPEH>0,OFFSET>0,SHAPE=$B$203),I204-I205,0)","v":0},null,null,null,null,null,null,null,null,"A77P",{"$f":"IF(SHAPE=$B$179,2,0)","v":0},{"$f":"IF(S206>0,\"Min Side:\",0)","v":0},{"$f":"IF(S206>0,C168,0)","v":0},{"$f":"IF(AND(S206>0,C181>0),1,0)","v":0}]
[null,null,null,null,null,null,null,"Angle of Cut:",{"$f":"IF(AND(SHAPEW>0,SHAPEH>0,OFFSET>0,SHAPE=$B$203),DEGREES(ATAN(SHAPEH/(SHAPEW/2))),0)","v":0},null,null,null,null,null,null,null,null,"A77P",{"$f":"IF(SHAPE=$B$179,3,0)","v":0},{"$f":"IF(S207>0,\"Peak Cut Angle:\",0)","v":0},{"$f":"IF(S207>0,J185,0)","v":0},{"$f":"IF(AND(S207>0,SHAPEW>0,SHAPEH>0,U207<H180),1,0)","v":0}]
[null,null,null,null,null,null,null,"1/2 Edge to Peak:",{"$f":"IF(AND(SHAPEW>0,SHAPEH>0,OFFSET>0,SHAPE=$B$203),I206/2,0)","v":0},{"$f":"IF(AND(SHAPEW>0,SHAPEH>0,OFFSET>0,SHAPE=$B$203),2*ACOS(((I211-OFFSET)-((I211-(OFFSET*2))))/(I211-OFFSET)),0)","v":0},"F",null,null,null,null,null,null,"A77P",{"$f":"IF(SHAPE=$B$179,4,0)","v":0},{"$f":"IF(S208>0,\"Peak Cut Length:\",0)","v":0},{"$f":"IF(S208>0,J180,0)","v":0},{"$f":"IF(AND(S208>0,U208>D180),1,0)","v":0}]
[null,null,null,null,null,null,null,"Angle of Edge to Peak:",{"$f":"IF(AND(SHAPEW>0,SHAPEH>0,OFFSET>0,SHAPE=$B$203),ACOS((SHAPEW/2)/I204),0)","v":0},{"$f":"IF(AND(SHAPEW>0,SHAPEH>0,OFFSET>0,SHAPE=$B$203),SHAPEW-(2*(OFFSET+(((2*(I211-OFFSET))-(2*(I211-OFFSET)*(SIN(J208/2))))/2))),0)","v":0},"Glass Width",null,null,null,null,null,null,"A77P",{"$f":"IF(SHAPE=$B$179,5,0)","v":0},{"$f":"IF(S209>0,\"Sill & Slant Angle:\",0)","v":0},{"$f":"IF(S209>0,J186,0)","v":0},{"$f":"IF(AND(S209>0,SHAPEW>0,SHAPEH>0,U209<H180),1,0)","v":0}]
[null,null,"Major Arc Length:",{"$f":"((((SHAPEW/2)-(SQRT(((((SQRT((SHAPEW/2)^2+SHAPEH^2))-((SHAPEW/2)-SHAPEH))/2)*TAN((ACOS((SHAPEW/2)/(SQRT((SHAPEW/2)^2+SHAPEH^2))))))^2+(((SQRT((SHAPEW/2)^2+SHAPEH^2))-((SHAPEW/2)-SHAPEH))/2)^2)))/(TAN((ACOS((SHAPEW/2)/(SQRT((SHAPEW/2)^2+SHAPEH^2)))))))+SHAPEH)*((ACOS((SHAPEW/2)/(SQRT((SHAPEW/2)^2+SHAPEH^2))))*2)","v":{"$error":"#DIV/0!"}},null,null,null,"Distance to Major:",{"$f":"IF(AND(SHAPEW>0,SHAPEH>0,OFFSET>0,SHAPE=$B$203),I208*TAN(I209),0)","v":0},{"$f":"IF(AND(SHAPEW>0,SHAPEH>0,OFFSET>0,SHAPE=$B$203),SHAPEH-(OFFSET*2),0)","v":0},"Glass Height",null,null,null,null,null,null,"A77P",{"$f":"IF(SHAPE=$B$179,6,0)","v":0},{"$f":"IF(S210>0,\"Sill & Slant Cut L:\",0)","v":0},{"$f":"IF(S210>0,J179,0)","v":0},{"$f":"IF(AND(S210>0,U210>D180),1,0)","v":0}]
[null,null,"Minor Arc Length:",{"$f":"(SQRT(((((SQRT((SHAPEW/2)^2+SHAPEH^2))-((SHAPEW/2)-SHAPEH))/2)*TAN((ACOS((SHAPEW/2)/(SQRT((SHAPEW/2)^2+SHAPEH^2))))))^2+(((SQRT((SHAPEW/2)^2+SHAPEH^2))-((SHAPEW/2)-SHAPEH))/2)^2))*(2*(RADIANS(90-(DEGREES(ACOS((SHAPEW/2)/(SQRT((SHAPEW/2)^2+SHAPEH^2))))))))","v":{"$error":"#DIV/0!"}},null,null,null,"Minor Radius:",{"$f":"IF(AND(SHAPEW>0,SHAPEH>0,OFFSET>0,SHAPE=$B$203),SQRT(I210^2+I208^2),0)","v":0},null,null,null,null,null,null,null,null,"A77P",{"$f":"IF(SHAPE=$B$179,7,0)","v":0},{"$f":"IF(S211>0,\"Corner Cut L:\",0)","v":0},{"$f":"IF(S211>0,J181,0)","v":0},{"$f":"IF(AND(S211>0,U211>D180),1,0)","v":0}]
[null,null,"Arc Length:",{"$f":"D210+D211","v":{"$error":"#DIV/0!"}},null,null,null,"Major Radius:",{"$f":"IF(AND(SHAPEW>0,SHAPEH>0,SHAPE=$B$203,OFFSET>0),J204+SHAPEH,0)","v":0},null,null,null,null,null,null,null,null,"A77P",{"$f":"IF(SHAPE=$B$179,8,0)","v":0},{"$f":"IF(S212>0,\"Glass Width:\",0)","v":0},{"$f":"IF(S212>0,J182,0)","v":0},{"$f":"IF(AND(U212>0,U212<GlassMinW),1,0)","v":0}]
[null,null,null,null,null,null,null,null,null,null,null,null,null,null,null,null,null,"A77P",{"$f":"IF(SHAPE=$B$179,9,0)","v":0},{"$f":"IF(S213>0,\"Glass Height:\",0)","v":0},{"$f":"IF(S213>0,J183,0)","v":0},{"$f":"IF(AND(U213>0,U213<GlassMinH),1,0)","v":0}]
[null,null,null,null,null,null,null,null,null,null,null,null,null,null,null,null,null,"A77P",{"$f":"IF(SHAPE=$B$179,10,0)","v":0},{"$f":"IF(S214>0,\"Max Width:\",0)","v":0},{"$f":"IF(S214>0,E180,0)","v":0},{"$f":"IF(AND(S214>0,SHAPEW>0,SHAPEW>U214),1,0)","v":0}]
[null,null,null,null,null,null,null,null,null,null,null,null,null,null,null,null,null,"A77P",{"$f":"IF(SHAPE=$B$179,11,0)","v":0},{"$f":"IF(S215>0,\"Max Height:\",0)","v":0},{"$f":"IF(S215>0,F180,0)","v":0},{"$f":"IF(AND(S215>0,SHAPEH>0,SHAPEH>U215),1,0)","v":0}]
[null,"A120","Min Side","Max W","Max UI","Max sq.ft",null,null,"Frame Height:",{"$f":"IF(AND(SHAPEW>0,OFFSET>0,SHAPE=$B$216),SHAPEW,0)","v":0},null,null,null,null,null,null,null,"A77P",{"$f":"IF(SHAPE=$B$179,12,0)","v":0},{"$f":"IF(S216>0,\"Max UI:\",0)","v":0},{"$f":"IF(S216>0,G180,0)","v":0},{"$f":"IF(AND(S216>0,G181>0),1,0)","v":0}]
[null,{"$f":"EXT","v":1},{"$f":"MINLEG","v":0},{"$f":"MAX_W","v":0},{"$f":"MAX_UI","v":0},{"$f":"MAXSF","v":0},null,null,"Leg Length:",{"$f":"IF(AND(SHAPEW>0,OFFSET>0,SHAPE=$B$216),((TAN(30*(PI()/180)))*SHAPEW/2)*2,0)","v":0},null,null,null,null,null,null,null,{"$f":"$B$191","v":"A77N"},{"$f":"IF(SHAPE=$B$191,1,0)","v":0},{"$f":"IF(S217>0,\"Roof Pitch:\",0)","v":0},{"$f":"IF(S217>0,L193,0)","v":0}]
[null,null,{"$f":"IF(AND(SHAPEW>0,SHAPE=$B$216,$J$217<$C$217),1,0)","v":0},{"$f":"IF(AND(SHAPEW>0,OFFSET>0,SHAPE=$B$216,SHAPEW>$D$217),1,0)","v":0},{"$f":"IF(AND(SHAPEW>0,SHAPEH>0,OFFSET>0,SHAPE=$B$216,(SHAPEW+SHAPEH)>$E$217),1,0)","v":0},{"$f":"IF(AND(SHAPEW>0,SHAPEH>0,OFFSET>0,SHAPE=$B$216,((SHAPEW*SHAPEH)/144)>$F$217),1,0)","v":0},null,null,"Glass Leg Length:",{"$f":"IF(AND(SHAPEW>0,OFFSET>0,SHAPE=$B$216),(((SHAPEW/2)-OFFSET)*TAN(RADIANS(30)))*2,0)","v":0},null,null,null,null,null,null,null,"A77N",{"$f":"IF(SHAPE=$B$191,2,0)","v":0},{"$f":"IF(S218>0,\"Min Side:\",0)","v":0},{"$f":"IF(S218>0,C192,0)","v":0},{"$f":"IF(AND(S218>0,C193>0),1,0)","v":0}]
[null,null,{"$f":"MAX(C218:F218)","v":0},{"$f":"IF(AND(SHAPE=$B$216,$C$219=1),1,0)","v":0},null,{"$f":"IF(AND(SHAPE=$B$216,SHAPEW>0,SHAPEH>0,SHAPEW<>SHAPEH),\"WIDTH AND HEIGHT MUST BE EQUAL\",IF(AND(SHAPE=$B$216,$J$219>0,$J$219<GlassMinW),\"Glass Width is Under Minimum\",IF(AND(SHAPE=$B$216,$J$220>0,$J$220<GlassMinH),\"Glass Height is Under Minimum\",\"\")))","v":""},null,null,"Glass Width:",{"$f":"IF(AND(SHAPEW>0,OFFSET>0,SHAPE=$B$216),SHAPEW-(OFFSET*2),0)","v":0},null,null,null,null,null,null,null,"A77N",{"$f":"IF(SHAPE=$B$191,3,0)","v":0},{"$f":"IF(S219>0,\"Sides Length:\",0)","v":0},{"$f":"IF(S219>0,K197,0)","v":0},{"$f":"IF(AND(S219>0,C193>0),1,0)","v":0}]
[null,null,null,null,null,null,null,null,"Glass Height:",{"$f":"IF(AND(SHAPEW>0,OFFSET>0,SHAPE=$B$216),$J$218+(2*($J$218*SIN(RADIANS(30)))),0)","v":0},null,null,null,null,null,null,null,"A77N",{"$f":"IF(SHAPE=$B$191,4,0)","v":0},{"$f":"IF(S220>0,\"Peak Cut Angle:\",0)","v":0},{"$f":"IF(S220>0,K196/2,0)","v":0},{"$f":"IF(AND(S220>0,SHAPEW>0,SHAPEH>0,U220<H192),1,0)","v":0}]
[null,null,null,null,null,null,null,null,null,null,null,null,null,null,null,null,null,"A77N",{"$f":"IF(SHAPE=$B$191,5,0)","v":0},{"$f":"IF(S221>0,\"Peak Cut L:\",0)","v":0},{"$f":"IF(S221>0,K192,0)","v":0},{"$f":"IF(AND(S221>0,U221>D192),1,0)","v":0}]
[null,null,null,null,null,null,null,null,null,null,null,null,null,null,null,null,null,"A77N",{"$f":"IF(SHAPE=$B$191,6,0)","v":0},{"$f":"IF(S222>0,\"Corner Cut Angle:\",0)","v":0},{"$f":"IF(S222>0,K195/2,0)","v":0},{"$f":"IF(AND(S222>0,SHAPEW>0,SHAPEH>0,U222<H192),1,0)","v":0}]
[null,null,null,null,null,null,null,null,null,null,null,null,null,null,null,null,null,"A77N",{"$f":"IF(SHAPE=$B$191,7,0)","v":0},{"$f":"IF(S223>0,\"Corner Cut L:\",0)","v":0},{"$f":"IF(S223>0,K191,0)","v":0},{"$f":"IF(AND(S223>0,U223>D192),1,0)","v":0}]
[null,null,null,null,null,null,null,null,null,null,null,null,null,null,null,null,null,"A77N",{"$f":"IF(SHAPE=$B$191,8,0)","v":0},{"$f":"IF(S224>0,\"Glass Width:\",0)","v":0},{"$f":"IF(S224>0,K193,0)","v":0},{"$f":"IF(AND(U224>0,U224<GlassMinW),1,0)","v":0}]
[null,"A121","Min Angle","Max Cut","Max W","Max H","Min Side","Max UI",null,"outer peak angle",{"$f":"IF(AND(SHAPEW>0,SHAPEH>0,DIM_3>0,OFFSET>0,SHAPE=$B$225),90-DEGREES(ATAN(((SHAPEW-DIM_3)/2)/(SHAPEH/2))),0)","v":0},{"$f":"IF(AND(SHAPEW>0,SHAPEH>0,OFFSET>0,DIM_3>0,SHAPE=$B$225),ROUND((12*TAN(RADIANS($K$225))),1)&\" /12\",0)","v":0},null,null,null,null,null,"A77N",{"$f":"IF(SHAPE=$B$191,9,0)","v":0},{"$f":"IF(S225>0,\"Glass Height:\",0)","v":0},{"$f":"IF(S225>0,K194,0)","v":0},{"$f":"IF(AND(U225>0,U225<GlassMinH),1,0)","v":0}]
[null,{"$f":"EXT","v":1},{"$f":"MINANGLE","v":0},{"$f":"MAXCUT","v":0},{"$f":"MAX_W","v":0},{"$f":"MAX_H","v":0},{"$f":"MINLEG","v":0},{"$f":"MAX_UI","v":0},null,"outer peak Hor. Cut",{"$f":"IF(AND(SHAPEW>0,SHAPEH>0,OFFSET>0,DIM_3>0,SHAPE=$B$225),OFFSET/SIN(RADIANS($K$225)),0)","v":0},null,null,null,null,null,null,"A77N",{"$f":"IF(SHAPE=$B$191,10,0)","v":0},{"$f":"IF(S226>0,\"Max Width:\",0)","v":0},{"$f":"IF(S226>0,E192,0)","v":0},{"$f":"IF(AND(S226>0,SHAPEW>0,SHAPEW>U226),1,0)","v":0}]
[null,null,{"$f":"IF(AND(SHAPEW>0,SHAPE=$B$225,OR($K$225<$C$226,$K$228<$C$226)),1,0)","v":0},{"$f":"IF(AND(SHAPEW>0,SHAPEH>0,SHAPE=$B$225,OR($K$226>$D$226,$K$227>$D$226)),1,0)","v":0},{"$f":"IF(AND(SHAPEW>0,OFFSET>0,SHAPE=$B$225,SHAPEW>$E$226),1,0)","v":0},{"$f":"IF(AND(SHAPEH>0,OFFSET>0,SHAPE=$B$225,SHAPEH>$F$226),1,0)","v":0},{"$f":"IF(AND(SHAPEW>0,DIM_3>0,SHAPE=$B$225,OR(DIM_3<$G$226,$K$229<$G$226)),1,0)","v":0},{"$f":"IF(AND(SHAPEW>0,SHAPEH>0,OFFSET>0,SHAPE=$B$225,(SHAPEW+SHAPEH)>$H$226),1,0)","v":0},null,"Bottom & Top Cut",{"$f":"IF(AND(SHAPEW>0,SHAPEH>0,OFFSET>0,DIM_3>0,SHAPE=$B$225),OFFSET/(COS(RADIANS(90-$K$228))),0)","v":0},null,null,null,null,null,null,"A77N",{"$f":"IF(SHAPE=$B$191,11,0)","v":0},{"$f":"IF(S227>0,\"Max Height:\",0)","v":0},{"$f":"IF(S227>0,F192,0)","v":0},{"$f":"IF(AND(S227>0,SHAPEH>0,SHAPEH>U227),1,0)","v":0}]
[null,null,{"$f":"MAX(C227:H227)","v":0},{"$f":"IF(AND(SHAPE=$B$225,$C$228=1),1,0)","v":0},null,{"$f":"IF(AND(SHAPE=$B$225,$K$230>0,$K$230<GlassMinW),\"Glass Width is Under Minimum\",IF(AND(SHAPE=$B$225,$K$231>0,$K$231<GlassMinH),\"Glass Height is Under Minimum\",\"\"))","v":""},null,null,null,"Angles at long legs",{"$f":"IF(AND(SHAPEW>0,SHAPEH>0,OFFSET>0,DIM_3>0,SHAPE=$B$225),90-$K$225/2,0)","v":0},null,null,null,null,null,null,"A77N",{"$f":"IF(SHAPE=$B$191,12,0)","v":0},{"$f":"IF(S228>0,\"Max UI:\",0)","v":0},{"$f":"IF(S228>0,G192,0)","v":0},{"$f":"IF(AND(S228>0,G193>0),1,0)","v":0}]
[null,null,null,null,null,null,null,null,null,"Slanted leg Length",{"$f":"IF(AND(SHAPEW>0,SHAPEH>0,OFFSET>0,DIM_3>0,SHAPE=$B$225),SQRT(((SHAPEW-DIM_3)/2)^2+(SHAPEH/2)^2),0)","v":0},null,null,null,{"$f":"IF(SHAPEW<=SHAPEH,((TAN(22.5*(PI()/180)))*SHAPEW/2)*2,((TAN(22.5*(PI()/180)))*SHAPEH/2)*2)","v":0},null,null,"A77N",{"$f":"IF(SHAPE=$B$191,13,0)","v":0},{"$f":"IF(S229>0,\"Min Widht:\",0)","v":0},{"$f":"IF(S229>0,I192,0)","v":0},{"$f":"IF(AND(S229>0,SHAPEW>0,I193>0),1,0)","v":0}]
[null,null,null,null,null,null,null,null,null,"Glass Width:",{"$f":"IF(AND(SHAPEW>0,SHAPEH>0,OFFSET>0,DIM_3>0,SHAPE=$B$225),SHAPEW-(2*$K$226),0)","v":0},null,null,null,{"$f":"O229*SIN(RADIANS(45))","v":0},null,null,{"$f":"$B$203","v":"A117"},{"$f":"IF(SHAPE=$B$203,1,0)","v":0},{"$f":"IF(S230>0,\"Frame Major R:\",0)","v":0},{"$f":"IF(S230>0,I212,0)","v":0},{"$f":"IF(AND(S230>0,I212<C204),1,0)","v":0}]
[null,null,null,null,null,null,null,null,null,"Glass Height:",{"$f":"IF(AND(SHAPEW>0,SHAPEH>0,OFFSET>0,DIM_3>0,SHAPE=$B$225),SHAPEH-(2*OFFSET),0)","v":0},null,null,null,{"$f":"IF(SHAPEH>SHAPEW,SHAPEH-(2*O230),SHAPEW-(2*O230))","v":0},null,null,{"$f":"$B$203","v":"A117"},{"$f":"IF(SHAPE=$B$203,2,0)","v":0},{"$f":"IF(S231>0,\"Frame Minor R:\",0)","v":0},{"$f":"IF(S231>0,I211,0)","v":0},{"$f":"IF(AND(S231>0,I211<C204),1,0)","v":0}]
[null,null,null,null,null,null,null,null,null,"Glass Dim3:",{"$f":"IF(AND(SHAPEW>0,SHAPEH>0,OFFSET>0,DIM_3>0,SHAPE=$B$225),DIM_3-((SQRT($K$227^2-OFFSET^2))*2),0)","v":0},null,null,null,{"$f":"(DIM_3-O231)/2","v":0},null,null,"A117",{"$f":"IF(SHAPE=$B$203,3,0)","v":0},{"$f":"IF(S232>0,\"Arc Length:\",0)","v":0},{"$f":"IF(S232>0,D212,0)","v":0},{"$f":"IF(AND(S232>0,D212>157),1,0)","v":{"$error":"#DIV/0!"}}]
[null,null,null,null,null,null,null,null,null,"Glass Slant Leg:",{"$f":"IF(AND(SHAPEW>0,SHAPEH>0,OFFSET>0,DIM_3>0,SHAPE=$B$225),SQRT((($K$230/2)-($K$232/2))^2+($K$231/2)^2),0)","v":0},null,null,null,{"$f":"O230-O232","v":0},null,null,"A117",{"$f":"IF(SHAPE=$B$203,4,0)","v":0},{"$f":"IF(S233>0,\"Glass Major R:\",0)","v":0},{"$f":"IF(S233>0,I212-OFFSET,0)","v":0}]
[null,null,null,null,null,null,null,null,null,null,null,null,null,null,{"$f":"SQRT(O230^2+O233^2)","v":0},null,null,"A117",{"$f":"IF(SHAPE=$B$203,5,0)","v":0},{"$f":"IF(S234>0,\"Glass Minor R:\",0)","v":0},{"$f":"IF(S234>0,I211-OFFSET,0)","v":0}]
[null,null,null,null,null,null,null,null,null,null,null,null,null,null,null,null,null,"A117",{"$f":"IF(SHAPE=$B$203,6,0)","v":0},{"$f":"IF(S235>0,\"Glass Width:\",0)","v":0},{"$f":"IF(S235>0,J209,0)","v":0},{"$f":"IF(AND(S235>0,U235>0,U235<GlassMinW),1,0)","v":0}]
[null,"A123","Max Cut","Min Side","Max W","Max H","Max UI","Min Angle","Vertical Leg",{"$f":"IF(AND(SHAPEW>0,SHAPEH>0,OFFSET>0,DIM_3>0,SHAPE=$B$236),IF(SHAPEW<=SHAPEH,DIM_3,((TAN(22.5*(PI()/180)))*SHAPEH/2)*2),0)","v":0},{"$f":"IF(AND(SHAPEW>0,SHAPEH>0,OFFSET>0,DIM_3>0,SHAPE=$B$236),IF(SHAPEW<=SHAPEH,((TAN(22.5*(PI()/180)))*SHAPEW/2)*2,((TAN(22.5*(PI()/180)))*SHAPEH/2)*2),0)","v":0},{"$f":"IF(AND(SHAPEW>0,SHAPEH>0,OFFSET>0,DIM_3>0,SHAPE=$B$236),ROUND((TAN(RADIANS(90-K241))*12),1)&\" /12\",0)","v":0},"Roof Pitch",null,null,null,null,"A117",{"$f":"IF(SHAPE=$B$203,7,0)","v":0},{"$f":"IF(S236>0,\"Glass Height:\",0)","v":0},{"$f":"IF(S236>0,J210,0)","v":0},{"$f":"IF(AND(S236>0,U236>0,U236<GlassMinH),1,0)","v":0}]
[null,{"$f":"EXT","v":1},{"$f":"MAXCUT","v":0},{"$f":"MINLEG","v":0},{"$f":"MAX_W","v":0},{"$f":"MAX_H","v":0},{"$f":"MAX_UI","v":0},{"$f":"MINANGLE","v":0},"Horizontal Leg",{"$f":"IF(AND(SHAPEW>0,SHAPEH>0,OFFSET>0,DIM_3>0,SHAPE=$B$236),IF(SHAPEW<=SHAPEH,((TAN(22.5*(PI()/180)))*SHAPEW/2)*2,DIM_3),0)","v":0},{"$f":"IF(AND(SHAPEW>0,SHAPEH>0,OFFSET>0,DIM_3>0,SHAPE=$B$236),K236*SIN(RADIANS(45)),0)","v":0},{"$f":"IF(AND(SHAPEW>0,SHAPEH>0,OFFSET>0,DIM_3>0,SHAPE=$B$236),J238-(SQRT(J243^2-OFFSET^2))-(SQRT(J244^2-OFFSET^2)),0)","v":0},"Glass Slanted Leg",null,null,null,null,"A117",{"$f":"IF(SHAPE=$B$203,8,0)","v":0},{"$f":"IF(S237>0,\"Max Width:\",0)","v":0},{"$f":"IF(S237>0,D204,0)","v":0},{"$f":"IF(AND(S237>0,SHAPEW>0,SHAPEW>U237),1,0)","v":0}]
[null,null,{"$f":"IF(AND(SHAPEW>0,SHAPE=$B$236,OR(J243>C237,J244>C237)),1,0)","v":0},{"$f":"IF(AND(SHAPEW>0,SHAPEH>0,DIM_3>0,SHAPE=$B$236,OR(J236<D237,J237<D237,J238<D237)),1,0)","v":0},{"$f":"IF(AND(SHAPEW>0,OFFSET>0,SHAPE=$B$236,SHAPEW>E237),1,0)","v":0},{"$f":"IF(AND(SHAPEW>0,OFFSET>0,SHAPE=$B$236,SHAPEH>F237),1,0)","v":0},{"$f":"IF(AND(SHAPEW>0,SHAPEH>0,SHAPE=$B$236,OFFSET>0,(SHAPEW+SHAPEH)>G237),1,0)","v":0},{"$f":"IF(AND(SHAPEW>0,SHAPEH>0,DIM_3>0,SHAPE=$B$236,OR(K242<H237,K244<H237)),1,0)","v":0},"Slanted Leg",{"$f":"IF(AND(SHAPEW>0,SHAPEH>0,OFFSET>0,DIM_3>0,SHAPE=$B$236),SQRT(O230^2+O233^2),0)","v":0},{"$f":"IF(AND(SHAPEW>0,SHAPEH>0,OFFSET>0,DIM_3>0,SHAPE=$B$236),IF(SHAPEH>SHAPEW,SHAPEH-(2*K237),SHAPEW-(2*K237)),0)","v":0},null,null,null,null,null,null,"A117",{"$f":"IF(SHAPE=$B$203,9,0)","v":0},{"$f":"IF(S238>0,\"Max UI:\",0)","v":0},{"$f":"IF(S238>0,E204,0)","v":0},{"$f":"IF(AND(S238>0,E205>0),1,0)","v":0}]
[null,null,{"$f":"MAX(C238:H238)","v":0},{"$f":"IF(AND(SHAPE=B236,C239=1),1,0)","v":0},null,null,{"$f":"IF(AND(SHAPE=$B$236,J241>0,J241<GlassMinW),\"Glass Width is Under Minimum\",IF(AND(SHAPE=$B$236,J242>0,J242<GlassMinH),\"Glass Height is Under Minimum\",\"\"))","v":""},null,"Glass Vert. Leg",{"$f":"IF(AND(SHAPEW>0,SHAPEH>0,OFFSET>0,DIM_3>0,SHAPE=$B$236),IF(SHAPEW>=SHAPEH,J236-(2*K245),J236-(2*K246)),0)","v":0},{"$f":"IF(AND(SHAPEW>0,SHAPEH>0,OFFSET>0,DIM_3>0,SHAPE=$B$236),(DIM_3-K238)/2,0)","v":0},null,null,null,null,null,null,{"$f":"$B$216","v":"A120"},{"$f":"IF(SHAPE=$B$216,1,0)","v":0},{"$f":"IF(S239>0,\"Frame Height:\",0)","v":0},{"$f":"IF(S239>0,J216,0)","v":0}]
[null,null,null,null,null,null,null,null,"Glass Hor. Leg",{"$f":"IF(AND(SHAPEW>0,SHAPEH>0,OFFSET>0,DIM_3>0,SHAPE=$B$236),IF(SHAPEW>=SHAPEH,J237-(2*K246),J237-(2*K245)),0)","v":0},{"$f":"IF(AND(SHAPEW>0,SHAPEH>0,OFFSET>0,DIM_3>0,SHAPE=$B$236),K237-K239,0)","v":0},null,null,null,null,null,null,{"$f":"$B$216","v":"A120"},{"$f":"IF(SHAPE=$B$216,2,0)","v":0},{"$f":"IF(S240>0,\"Frame Leg:\",0)","v":0},{"$f":"IF(S240>0,J217,0)","v":0},{"$f":"IF(AND(S240>0,$C$218>0),1,0)","v":0}]
[null,null,null,null,null,null,null,null,"Glass Width",{"$f":"IF(AND(SHAPEW>0,SHAPEH>0,OFFSET>0,DIM_3>0,SHAPE=$B$236),SHAPEW-(2*OFFSET),0)","v":0},{"$f":"IF(AND(SHAPEW>0,SHAPEH>0,OFFSET>0,DIM_3>0,SHAPE=$B$236),DEGREES(ATAN(K240/K237)),0)","v":0},null,null,null,null,null,null,"A120",{"$f":"IF(SHAPE=$B$216,3,0)","v":0},{"$f":"IF(S241>0,\"Min Leg:\",0)","v":0},{"$f":"IF(S241>0,C217,0)","v":0},{"$f":"IF(AND(S241>0,$C$218>0),1,0)","v":0}]
[null,null,null,null,null,null,null,null,"Glass Height",{"$f":"IF(AND(SHAPEW>0,SHAPEH>0,OFFSET>0,DIM_3>0,SHAPE=$B$236),SHAPEH-(2*OFFSET),0)","v":0},{"$f":"IF(AND(SHAPEW>0,SHAPEH>0,OFFSET>0,DIM_3>0,SHAPE=$B$236),90-(K241/2),0)","v":0},null,null,null,null,null,null,"A120",{"$f":"IF(SHAPE=$B$216,4,0)","v":0},{"$f":"IF(S242>0,\"Glass Width:\",0)","v":0},{"$f":"IF(S242>0,J219,0)","v":0},{"$f":"IF(AND($U$242>0,$U$242<GlassMinW),1,0)","v":0}]
[null,null,null,null,null,null,null,null,"Cut L @ V & Slant",{"$f":"IF(AND(SHAPEW>0,SHAPEH>0,OFFSET>0,DIM_3>0,SHAPE=$B$236),IF(SHAPEW>SHAPEH,SQRT(K245^2+CUTOFFSET^2),SQRT(K246^2+CUTOFFSET^2)),0)","v":0},{"$f":"IF(AND(SHAPEW>0,SHAPEH>0,OFFSET>0,DIM_3>0,SHAPE=$B$236),90-K241,0)","v":0},null,null,null,null,null,null,"A120",{"$f":"IF(SHAPE=$B$216,5,0)","v":0},{"$f":"IF(S243>0,\"Glass Height:\",0)","v":0},{"$f":"IF(S243>0,J220,0)","v":0},{"$f":"IF(AND($U$243>0,$U$243<GlassMinH),1,0)","v":0}]
[null,null,null,null,null,null,null,null,"Cut L @ H & Slant",{"$f":"IF(AND(SHAPEW>0,SHAPEH>0,OFFSET>0,DIM_3>0,SHAPE=$B$236),IF(SHAPEH>SHAPEW,SQRT(K245^2+CUTOFFSET^2),SQRT(K246^2+CUTOFFSET^2)),0)","v":0},{"$f":"IF(AND(SHAPEW>0,SHAPEH>0,OFFSET>0,DIM_3>0,SHAPE=$B$236),K241+(K243/2),0)","v":0},null,null,null,null,null,null,"A120",{"$f":"IF(SHAPE=$B$216,6,0)","v":0},{"$f":"IF(S244>0,\"Glass Leg:\",0)","v":0},{"$f":"IF(S244>0,J218,0)","v":0}]
[null,null,null,null,null,null,null,null,null,null,{"$f":"IF(AND(SHAPEW>0,SHAPEH>0,OFFSET>0,DIM_3>0,SHAPE=$B$236),OFFSET/TAN(RADIANS(K242)),0)","v":0},null,null,null,null,null,null,"A120",{"$f":"IF(SHAPE=$B$216,7,0)","v":0},{"$f":"IF(S245>0,\"Max Width:\",0)","v":0},{"$f":"IF(S245>0,D217,0)","v":0},{"$f":"IF(AND($S$245>0,SHAPEW>0,SHAPEW>$U$245),1,0)","v":0}]
[null,null,null,null,null,null,null,null,null,null,{"$f":"IF(AND(SHAPEW>0,SHAPEH>0,OFFSET>0,DIM_3>0,SHAPE=$B$236),OFFSET/TAN(RADIANS(K244)),0)","v":0},null,null,null,null,null,null,"A120",{"$f":"IF(SHAPE=$B$216,8,0)","v":0},{"$f":"IF(S246>0,\"Max UI:\",0)","v":0},{"$f":"IF(S246>0,E217,0)","v":0},{"$f":"IF(AND(S246>0,E218>0),1,0)","v":0}]
[null,null,null,null,null,null,null,null,null,null,null,null,null,null,null,null,null,{"$f":"$B$225","v":"A121"},{"$f":"IF(SHAPE=$B$225,1,0)","v":0},{"$f":"IF(S247>0,\"Roof Pitch:\",0)","v":0},{"$f":"IF(S247>0,L225,0)","v":0}]
[null,"A124","Max Cut","Min Side","Max W","Max UI",null,"Unit Height:",{"$f":"IF(AND(SHAPEW>0,OFFSET>0,SHAPE=$B$248),(SHAPEW*COS(RADIANS(54)))+(SHAPEW*SIN(RADIANS(72))),0)","v":0},null,null,null,null,null,null,null,null,{"$f":"$B$225","v":"A121"},{"$f":"IF(SHAPE=$B$225,2,0)","v":0},{"$f":"IF(S248>0,\"Horizontal Leg:\",0)","v":0},{"$f":"IF(AND(S248>0,DIM_3>0),DIM_3,0)","v":0},{"$f":"IF(AND(S247>0,DIM_3<G226),1,0)","v":0}]
[null,{"$f":"EXT","v":1},{"$f":"MAXCUT","v":0},{"$f":"MINLEG","v":0},{"$f":"MAX_W","v":0},{"$f":"MAX_UI","v":0},null,"Cut Length:",{"$f":"IF(AND(SHAPEW>0,OFFSET>0,SHAPE=$B$248),OFFSET/SIN(RADIANS(54)),0)","v":0},{"$f":"IF(AND(SHAPEW>0,OFFSET>0,SHAPE=$B$248),SHAPEW-((SQRT(I249^2-OFFSET^2))*2),0)","v":0},null,null,null,null,null,null,null,"A121",{"$f":"IF(SHAPE=$B$225,3,0)","v":0},{"$f":"IF(S249>0,\"Slanted Leg:\",0)","v":0},{"$f":"IF(S249>0,K229,0)","v":0},{"$f":"IF(AND(S249>0,K229<G226),1,0)","v":0}]
[null,null,{"$f":"IF(AND(SHAPEW>0,SHAPE=$B$248,OR(I249>C249,I250>C249)),1,0)","v":0},{"$f":"IF(AND(SHAPEW>0,SHAPE=$B$248,I252<D249),1,0)","v":0},{"$f":"IF(AND(SHAPEW>0,SHAPE=124,OFFSET>0,SHAPEW>E249),1,0)","v":0},{"$f":"IF(AND(SHAPEW>0,SHAPE=124,OFFSET>0,(SHAPEW+I248)>F249),1,0)","v":0},null,"Cut L (SH2201):",{"$f":"IF(AND(SHAPEW>0,OFFSET>0,SHAPE=$B$248),IF(AO78=3,(OFFSET+0.625)/SIN(RADIANS(54)),0),0)","v":0},{"$f":"J249*COS(RADIANS(72))","v":0},null,null,null,null,null,null,null,"A121",{"$f":"IF(SHAPE=$B$225,4,0)","v":0},{"$f":"IF(S250>0,\"Min Leg:\",0)","v":0},{"$f":"IF(S250>0,G226,0)","v":0},{"$f":"IF(AND(S250>0,G227>0),1,0)","v":0}]
[null,null,{"$f":"MAX(C250:F250)","v":0},{"$f":"IF(AND(SHAPE=B248,C251=1),1,0)","v":0},null,{"$f":"IF(AND(SHAPE=$B$248,I253>0,I253<GlassMinW),\"Glass Width is Under Minimum\",IF(AND(SHAPE=$B$248,I254>0,I254<GlassMinH),\"Glass Height is Under Minimum\",\"\"))","v":""},null,"Glass Height",{"$f":"IF(AND(SHAPEW>0,OFFSET>0,SHAPE=$B$248),I248-(OFFSET+I249),0)","v":0},null,null,null,null,null,null,null,null,"A121",{"$f":"IF(SHAPE=$B$225,5,0)","v":0},{"$f":"IF(S251>0,\"Outer Peak Angle:\",0)","v":0},{"$f":"IF(S251>0,K225,0)","v":0},{"$f":"IF(AND(S251>0,C227>0,K225<C226),1,0)","v":0}]
[null,null,null,null,null,null,null,"Leg Length",{"$f":"IF(AND(SHAPEW>0,OFFSET>0,SHAPE=$B$248),SHAPEW,0)","v":0},null,null,null,null,null,null,null,null,"A121",{"$f":"IF(SHAPE=$B$225,6,0)","v":0},{"$f":"IF(S252>0,\"Outer Peak Cut L:\",0)","v":0},{"$f":"IF(S252>0,K226,0)","v":0},{"$f":"IF(AND(S252>0,D227>0,K226>D226),1,0)","v":0}]
[null,null,null,null,null,null,null,"Glass Width:",{"$f":"J249+(2*J250)","v":0},null,null,null,null,null,null,null,null,"A121",{"$f":"IF(SHAPE=$B$225,7,0)","v":0},{"$f":"IF(S253>0,\"Top & Bott Angles:\",0)","v":0},{"$f":"IF(S253>0,K228,0)","v":0},{"$f":"IF(AND(S253>0,C227>0,K228<C226),1,0)","v":0}]
[null,null,null,null,null,null,null,"Glass Height:",{"$f":"IF(AND(SHAPEW>0,OFFSET>0,SHAPE=$B$248),I248-OFFSET-I249,0)","v":0},null,null,null,null,null,null,null,null,"A121",{"$f":"IF(SHAPE=$B$225,8,0)","v":0},{"$f":"IF(S254>0,\"Top & Bott Cut L:\",0)","v":0},{"$f":"IF(S254>0,K227,0)","v":0},{"$f":"IF(AND(S254>0,D227>0,K227>D226),1,0)","v":0}]
[null,null,null,null,null,null,null,"Glass Leg:",{"$f":"IF(AND(SHAPEW>0,OFFSET>0,SHAPE=$B$248),I252-((SQRT(I249^2-OFFSET^2))*2),0)","v":0},null,null,null,null,null,null,null,null,"A121",{"$f":"IF(SHAPE=$B$225,9,0)","v":0},{"$f":"IF(S255>0,\"Glass Width:\",0)","v":0},{"$f":"IF(S255>0,K230,0)","v":0},{"$f":"IF(AND(U255>0,U255<GlassMinW),1,0)","v":0}]
[null,null,null,null,null,null,null,null,null,null,null,null,null,null,null,null,null,"A121",{"$f":"IF(SHAPE=$B$225,10,0)","v":0},{"$f":"IF(S256>0,\"Glass Height:\",0)","v":0},{"$f":"IF(S256>0,K231,0)","v":0},{"$f":"IF(AND(U256>0,U256<GlassMinH),1,0)","v":0}]
[null,null,null,null,null,null,null,null,null,null,null,null,null,null,null,null,null,"A121",{"$f":"IF(SHAPE=$B$225,11,0)","v":0},{"$f":"IF(S257>0,\"Glass Hor. Leg:\",0)","v":0},{"$f":"IF(S257>0,K232,0)","v":0}]
[null,null,null,null,null,null,null,null,null,null,null,null,null,null,null,null,null,"A121",{"$f":"IF(SHAPE=$B$225,12,0)","v":0},{"$f":"IF(S258>0,\"Glass Slanted Leg:\",0)","v":0},{"$f":"IF(S258>0,K233,0)","v":0}]
[null,"A127","Min R","Max W","Max H","Max UI","Max Cut","Min W",null,"Frame Radius:",{"$f":"IF(AND(SHAPEW>0,SHAPEH>0,OFFSET>0,SHAPE=$B$259),((SHAPEH)^2+(SHAPEW/2)^2)/(2*(SHAPEW/2)),0)","v":0},null,null,null,null,null,null,"A121",{"$f":"IF(SHAPE=$B$225,13,0)","v":0},{"$f":"IF(S259>0,\"Max Width:\",0)","v":0},{"$f":"IF(S259>0,E226,0)","v":0},{"$f":"IF(AND(S259>0,SHAPEW>0,SHAPEW>U259),1,0)","v":0}]
[null,{"$f":"EXT","v":1},{"$f":"MINRADIUS","v":0},{"$f":"MAX_W","v":0},{"$f":"MAX_H","v":0},{"$f":"MAX_UI","v":0},{"$f":"MAXCUT","v":0},{"$f":"MIN_w","v":0},null,"Glass Radius:",{"$f":"IF(AND(SHAPEW>0,SHAPEH>0,OFFSET>0,SHAPE=$B$259),K259-OFFSET,0)","v":0},{"$f":"IF(AND(SHAPEW>0,SHAPEH>0,OFFSET>0,SHAPE=$B$259),K259-CUTOFFSET,0)","v":0},null,null,null,null,null,"A121",{"$f":"IF(SHAPE=$B$225,14,0)","v":0},{"$f":"IF(S260>0,\"Max Height:\",0)","v":0},{"$f":"IF(S260>0,F226,0)","v":0},{"$f":"IF(AND(S260>0,SHAPEW>0,SHAPEH>U260),1,0)","v":0}]
[null,null,{"$f":"IF(AND(SHAPEW>0,SHAPE=$B$259,K259<C260),1,0)","v":0},{"$f":"IF(AND(SHAPEW>0,SHAPE=$B$259,OFFSET>0,SHAPEW>D260),1,0)","v":0},{"$f":"IF(AND(SHAPEH>0,SHAPE=$B$259,OFFSET>0,SHAPEH>E260),1,0)","v":0},{"$f":"IF(AND(SHAPEW>0,SHAPEH>0,SHAPE=$B$259,OFFSET>0,(SHAPEW+SHAPEH)>F260),1,0)","v":0},{"$f":"IF(AND(SHAPEW>0,SHAPEH>0,SHAPE=$B$259,OR(K267>G260,K268>G260)),1,0)","v":0},{"$f":"IF(AND(SHAPEW>0,SHAPEH>0,SHAPE=$B$259,OFFSET>0,SHAPEW<H260),1,0)","v":0},null,"Glass Width:",{"$f":"IF(AND(SHAPEW>0,SHAPEH>0,OFFSET>0,SHAPE=$B$259),(((SHAPEW/2)-((OFFSET*2)+K265))*2)+(OFFSET*2),0)","v":0},{"$f":"IF(AND(SHAPEW>0,SHAPEH>0,OFFSET>0,SHAPE=$B$259),(((SHAPEW/2)-((CUTOFFSET*2)+L265))*2)+(CUTOFFSET*2),0)","v":0},null,null,null,null,null,"A121",{"$f":"IF(SHAPE=$B$225,15,0)","v":0},{"$f":"IF(S261>0,\"Max UI:\",0)","v":0},{"$f":"IF(S261>0,H226,0)","v":0},{"$f":"IF(AND(S261>0,H227>0),1,0)","v":0}]
[null,null,{"$f":"MAX(C261:H261)","v":0},{"$f":"IF(AND(SHAPE=$B$259,C262=1),1,0)","v":0},{"$f":"IF(AND(SHAPEW>0,SHAPEH>0,SHAPE=$B$259,SHAPEH<=(SHAPEW/2)),1,0)","v":0},{"$f":"IF(AND(SHAPE=$B$259,E262=1),\"FRAME HEIGHT MUST BE GREATER THAN 1/2 THE WIDTH\",IF(AND(SHAPE=$B$259,SHAPEW>0,C261>0),\"RADIUS MUST BE GREATER THAN \"&C260,IF(AND(SHAPE=$B$259,K261>0,K261<GlassMinW),\"Glass Width is Under Minimum\",IF(AND(SHAPE=$B$259,K262>0,K262<GlassMinH),\"Glass Height is Under Minimum\",\"\"))))","v":""},null,null,null,"Glass Height:",{"$f":"IF(AND(SHAPEW>0,SHAPEH>0,OFFSET>0,SHAPE=$B$259),((SQRT(K266*((2*K260)-K266))))-OFFSET,0)","v":0},{"$f":"IF(AND(SHAPEW>0,SHAPEH>0,OFFSET>0,SHAPE=$B$259),((SQRT(L266*((2*L260)-L266))))-CUTOFFSET,0)","v":0},null,null,null,null,null,{"$f":"$B$236","v":"A123"},{"$f":"IF(SHAPE=$B$236,1,0)","v":0},{"$f":"IF(S262>0,\"Roof Pitch:\",0)","v":0},{"$f":"IF(S262>0,L236,0)","v":0}]
[null,null,null,null,null,null,null,null,null,"F",{"$f":"IF(AND(SHAPEW>0,SHAPEH>0,OFFSET>0,SHAPE=$B$259),2*(ASIN((OFFSET*2)/(2*K260))),0)","v":0},{"$f":"IF(AND(SHAPEW>0,SHAPEH>0,OFFSET>0,SHAPE=$B$259),2*(ASIN((CUTOFFSET*2)/(2*L260))),0)","v":0},null,null,null,null,null,{"$f":"$B$236","v":"A123"},{"$f":"IF(SHAPE=$B$236,2,0)","v":0},{"$f":"IF(S263>0,\"Horizontal Leg:\",0)","v":0},{"$f":"IF(S263>0,J237,0)","v":0},{"$f":"IF(AND(S263>0,DIM_3<D237),1,0)","v":0}]
[null,null,null,null,null,null,null,null,null,"d",{"$f":"IF(AND(SHAPEW>0,SHAPEH>0,OFFSET>0,SHAPE=$B$259),K260*COS(K263/2),0)","v":0},{"$f":"IF(AND(SHAPEW>0,SHAPEH>0,OFFSET>0,SHAPE=$B$259),L260*COS(L263/2),0)","v":0},null,null,null,null,null,"A123",{"$f":"IF(SHAPE=$B$236,3,0)","v":0},{"$f":"IF(S264>0,\"Slanted Leg:\",0)","v":0},{"$f":"IF(S264>0,J238,0)","v":0},{"$f":"IF(AND(S264>0,J238<D237),1,0)","v":0}]
[null,null,null,null,null,null,null,null,null,"h",{"$f":"IF(AND(SHAPEW>0,SHAPEH>0,OFFSET>0,SHAPE=$B$259),K260-K264,0)","v":0},{"$f":"IF(AND(SHAPEW>0,SHAPEH>0,OFFSET>0,SHAPE=$B$259),L260-L264,0)","v":0},null,null,null,null,null,"A123",{"$f":"IF(SHAPE=$B$236,4,0)","v":0},{"$f":"IF(S265>0,\"Vertical Leg:\",0)","v":0},{"$f":"IF(S265>0,J236,0)","v":0},{"$f":"IF(AND(S265>0,J236<D237),1,0)","v":0}]
[null,null,null,null,null,null,null,null,null,"h_Glass",{"$f":"IF(AND(SHAPEW>0,SHAPEH>0,OFFSET>0,SHAPE=$B$259),((SHAPEW/2)-((OFFSET*2)+K265)+OFFSET+K265),0)","v":0},{"$f":"IF(AND(SHAPEW>0,SHAPEH>0,OFFSET>0,SHAPE=$B$259),((SHAPEW/2)-((CUTOFFSET*2)+L265)+CUTOFFSET+L265),0)","v":0},null,null,null,null,null,"A123",{"$f":"IF(SHAPE=$B$236,5,0)","v":0},{"$f":"IF(S266>0,\"Vert & Slant Angle:\",0)","v":0},{"$f":"IF(S266>0,K242,0)","v":0},{"$f":"IF(AND(S266>0,K242<H237),1,0)","v":0}]
[null,null,null,null,null,null,null,null,null,"Cut @ Peak:",{"$f":"IF(AND(SHAPEW>0,SHAPEH>0,OFFSET>0,SHAPE=$B$259),SHAPEH-CUTOFFSET-L262,0)","v":0},null,null,null,null,null,null,"A123",{"$f":"IF(SHAPE=$B$236,6,0)","v":0},{"$f":"IF(S267>0,\"Hor & Slant Angle:\",0)","v":0},{"$f":"IF(S267>0,K244,0)","v":0},{"$f":"IF(AND(S267>0,K244<H237),1,0)","v":0}]
[null,null,null,null,null,null,null,null,null,"Cut @ Corners:",{"$f":"IF(AND(SHAPEW>0,SHAPEH>0,OFFSET>0,SHAPE=$B$259),SQRT(CUTOFFSET^2+((SHAPEW/2)-(L266-L265))^2),0)","v":0},null,null,null,null,null,null,"A123",{"$f":"IF(SHAPE=$B$236,7,0)","v":0},{"$f":"IF(S268>0,\"Vert & Slant Cut L:\",0)","v":0},{"$f":"IF(S268>0,J243,0)","v":0},{"$f":"IF(AND(S268>0,J243>C237),1,0)","v":0}]
[null,null,null,null,null,null,null,null,null,null,null,null,null,null,null,null,null,"A123",{"$f":"IF(SHAPE=$B$236,8,0)","v":0},{"$f":"IF(S269>0,\"Hor & Slant Cut L:\",0)","v":0},{"$f":"IF(S269>0,J244,0)","v":0},{"$f":"IF(AND(S269>0,J244>C237),1,0)","v":0}]
[null,null,null,null,null,null,null,null,null,null,null,null,null,null,null,null,null,"A123",{"$f":"IF(SHAPE=$B$236,9,0)","v":0},{"$f":"IF(S270>0,\"Glass Width:\",0)","v":0},{"$f":"IF(S270>0,J241,0)","v":0},{"$f":"IF(AND(U270>0,U270<GlassMinW),1,0)","v":0}]
[null,"A128","Min R","Max W","Max H","Min Leg","Max UI","Max Cut","Min W","Frame Radius:",{"$f":"IF(AND(SHAPEW>0,SHAPEH>0,DIM_4>0,OFFSET>0,SHAPE=$B$271),(((SHAPEH-DIM_4))^2+(SHAPEW/2)^2)/(2*(SHAPEW/2)),0)","v":0},null,null,null,null,null,null,"A123",{"$f":"IF(SHAPE=$B$236,10,0)","v":0},{"$f":"IF(S271>0,\"Glass Height:\",0)","v":0},{"$f":"IF(S271>0,J242,0)","v":0},{"$f":"IF(AND(U271>0,U271<GlassMinH),1,0)","v":0}]
[null,{"$f":"EXT","v":1},{"$f":"MINRADIUS","v":0},{"$f":"MAX_W","v":0},{"$f":"MAX_H","v":0},{"$f":"MINLEG","v":0},{"$f":"MAX_UI","v":0},{"$f":"MAXCUT","v":0},{"$f":"MIN_w","v":0},"Glass Radius:",{"$f":"IF(AND(SHAPEW>0,SHAPEH>0,DIM_4>0,OFFSET>0,SHAPE=$B$271),K271-OFFSET,0)","v":0},{"$f":"IF(AND(SHAPEW>0,SHAPEH>0,DIM_4>0,OFFSET>0,SHAPE=$B$271),K271-CUTOFFSET,0)","v":0},null,null,null,null,null,"A123",{"$f":"IF(SHAPE=$B$236,11,0)","v":0},{"$f":"IF(S272>0,\"Glass Hor. Leg:\",0)","v":0},{"$f":"IF(S272>0,J240,0)","v":0}]
[null,null,{"$f":"IF(AND(SHAPEW>0,SHAPEH>0,DIM_4>0,OFFSET>0,SHAPE=$B$271,K271<C272),1,0)","v":0},{"$f":"IF(AND(SHAPEW>0,SHAPE=$B$271,OFFSET>0,SHAPEW>D272),1,0)","v":0},{"$f":"IF(AND(SHAPEW>0,SHAPE=$B$271,OFFSET>0,SHAPEH>E272),1,0)","v":0},{"$f":"IF(AND(SHAPEH>0,SHAPE=$B$271,OFFSET>0,DIM_4<F272),1,0)","v":0},{"$f":"IF(AND(SHAPEW>0,SHAPEH>0,SHAPE=$B$271,OFFSET>0,(SHAPEW+SHAPEH)>G272),1,0)","v":0},{"$f":"IF(AND(SHAPEW>0,SHAPEH>0,DIM_4>0,OFFSET>0,SHAPE=$B$271,OR(K280>H272,K281>H272)),1,0)","v":0},{"$f":"IF(AND(SHAPEW>0,SHAPEH>0,SHAPE=$B$271,OFFSET>0,SHAPEW<I272),1,0)","v":0},"Glass Width:",{"$f":"IF(AND(SHAPEW>0,SHAPEH>0,DIM_4>0,OFFSET>0,SHAPE=$B$271),SHAPEW-(OFFSET*2),0)","v":0},{"$f":"IF(AND(SHAPEW>0,SHAPEH>0,DIM_4>0,OFFSET>0,SHAPE=$B$271),SHAPEW-(CUTOFFSET*2),0)","v":0},null,null,null,null,null,"A123",{"$f":"IF(SHAPE=$B$236,12,0)","v":0},{"$f":"IF(S273>0,\"Glass Vert. Leg:\",0)","v":0},{"$f":"IF(S273>0,J239,0)","v":0}]
[null,null,{"$f":"MAX(C273:I273)","v":0},{"$f":"IF(AND(SHAPE=B271,C274=1),1,0)","v":0},null,{"$f":"IF(AND(SHAPEW>0,SHAPEH>0,SHAPE=$B$271,(SHAPEH-DIM_4)<=(SHAPEW/2)),1,0)","v":0},{"$f":"IF(AND(SHAPE=$B$271,F274=1),\"FRAME HEIGHT MINUS DIM4, MUST BE GREATER THAN 1/2 THE WIDTH\",IF(AND(SHAPE=$B$271,SHAPEW>0,C273>0),\"RADIUS MUST BE GREATER THAN \"&C272,IF(AND(SHAPE=$B$271,K273>0,K273<GlassMinW),\"Glass Width is Under Minimum\",IF(AND(SHAPE=$B$271,K274>0,K274<GlassMinH),\"Glass Height is Under Minimum\",\"\"))))","v":""},null,null,"Glass Height:",{"$f":"IF(AND(SHAPEW>0,SHAPEH>0,DIM_4>0,OFFSET>0,SHAPE=$B$271),(((SQRT(K279*((2*K272)-K279))))-OFFSET)+DIM_4,0)","v":0},{"$f":"IF(AND(SHAPEW>0,SHAPEH>0,DIM_4>0,OFFSET>0,SHAPE=$B$271),(((SQRT(L279*((2*L272)-L279))))-CUTOFFSET)+DIM_4,0)","v":0},null,null,null,null,null,"A123",{"$f":"IF(SHAPE=$B$236,13,0)","v":0},{"$f":"IF(S274>0,\"Max Width:\",0)","v":0},{"$f":"IF(S274>0,E237,0)","v":0},{"$f":"IF(AND(S274>0,SHAPEW>0,SHAPEW>U274),1,0)","v":0}]
[null,null,null,null,null,null,null,null,null,"Glass Leg H:",{"$f":"IF(AND(SHAPEW>0,SHAPEH>0,DIM_4>0,OFFSET>0,SHAPE=$B$271),DIM_4-OFFSET,0)","v":0},{"$f":"IF(AND(SHAPEW>0,SHAPEH>0,DIM_4>0,OFFSET>0,SHAPE=$B$271),DIM_4-CUTOFFSET,0)","v":0},null,null,null,null,null,"A123",{"$f":"IF(SHAPE=$B$236,14,0)","v":0},{"$f":"IF(S275>0,\"Max Height:\",0)","v":0},{"$f":"IF(S275>0,F237,0)","v":0},{"$f":"IF(AND(S275>0,SHAPEH>0,SHAPEH>U275),1,0)","v":0}]
[null,null,null,null,null,null,null,null,null,"F",{"$f":"IF(AND(SHAPEW>0,SHAPEH>0,DIM_4>0,OFFSET>0,SHAPE=$B$271),2*(ASIN((OFFSET*2)/(2*K272))),0)","v":0},{"$f":"IF(AND(SHAPEW>0,SHAPEH>0,DIM_4>0,OFFSET>0,SHAPE=$B$271),2*(ASIN((CUTOFFSET*2)/(2*L272))),0)","v":0},null,null,null,null,null,"A123",{"$f":"IF(SHAPE=$B$236,15,0)","v":0},{"$f":"IF(S276>0,\"Max UI:\",0)","v":0},{"$f":"IF(S276>0,G237,0)","v":0},{"$f":"IF(AND(S276>0,G238>0),1,0)","v":0}]
[null,null,null,null,null,null,null,null,null,"d",{"$f":"IF(AND(SHAPEW>0,SHAPEH>0,DIM_4>0,OFFSET>0,SHAPE=$B$271),K272*COS(K276/2),0)","v":0},{"$f":"IF(AND(SHAPEW>0,SHAPEH>0,DIM_4>0,OFFSET>0,SHAPE=$B$271),L272*COS(L276/2),0)","v":0},null,null,null,null,null,{"$f":"$B$248","v":"A124"},{"$f":"IF(SHAPE=$B$248,1,0)","v":0},{"$f":"IF(S277>0,\"Frame Height:\",0)","v":0},{"$f":"IF(S277>0,I248,0)","v":0}]
[null,null,null,null,null,null,null,null,null,"h",{"$f":"IF(AND(SHAPEW>0,SHAPEH>0,DIM_4>0,OFFSET>0,SHAPE=$B$271),K272-K277,0)","v":0},{"$f":"IF(AND(SHAPEW>0,SHAPEH>0,DIM_4>0,OFFSET>0,SHAPE=$B$271),L272-L277,0)","v":0},null,null,null,null,null,{"$f":"$B$248","v":"A124"},{"$f":"IF(SHAPE=$B$248,2,0)","v":0},{"$f":"IF(S278>0,\"Frame Leg:\",0)","v":0},{"$f":"IF(S278>0,I252,0)","v":0},{"$f":"IF(AND(S278>0,D250>0),1,0)","v":0}]
[null,null,null,null,null,null,null,null,null,"h_Glass",{"$f":"IF(AND(SHAPEW>0,SHAPEH>0,DIM_4>0,OFFSET>0,SHAPE=$B$271),((SHAPEW/2)-((OFFSET*2)+K278)+OFFSET+K278),0)","v":0},{"$f":"IF(AND(SHAPEW>0,SHAPEH>0,DIM_4>0,OFFSET>0,SHAPE=$B$271),((SHAPEW/2)-((CUTOFFSET*2)+L278)+CUTOFFSET+L278),0)","v":0},null,null,null,null,null,"A124",{"$f":"IF(SHAPE=$B$248,3,0)","v":0},{"$f":"IF(S279>0,\"Cut Length:\",0)","v":0},{"$f":"IF(S279>0,I249,0)","v":0},{"$f":"IF(AND(S279>0,C250>0),1,0)","v":0}]
[null,null,null,null,null,null,null,null,null,"Cut @ Peak:",{"$f":"IF(AND(SHAPEW>0,SHAPEH>0,DIM_4>0,OFFSET>0,SHAPE=$B$271),SHAPEH-CUTOFFSET-L274,0)","v":0},null,null,null,null,null,null,"A124",{"$f":"IF(SHAPE=$B$248,4,0)","v":0},{"$f":"IF(S280>0,\"Glass Width:\",0)","v":0},{"$f":"IF(S280>0,I253,0)","v":0},{"$f":"IF(AND(U280>0,U280<GlassMinW),1,0)","v":0}]
[null,null,null,null,null,null,null,null,null,"Cut @ Corners:",{"$f":"IF(AND(SHAPEW>0,SHAPEH>0,DIM_4>0,OFFSET>0,SHAPE=$B$271),SQRT(CUTOFFSET^2+CUTOFFSET^2),0)","v":0},null,null,null,null,null,null,"A124",{"$f":"IF(SHAPE=$B$248,5,0)","v":0},{"$f":"IF(S281>0,\"Glass Height:\",0)","v":0},{"$f":"IF(S281>0,I254,0)","v":0},{"$f":"IF(AND(U281>0,U281<GlassMinH),1,0)","v":0}]
[null,null,null,null,null,null,null,null,null,null,null,null,null,null,null,null,null,"A124",{"$f":"IF(SHAPE=$B$248,6,0)","v":0},{"$f":"IF(S282>0,\"Glass Leg:\",0)","v":0},{"$f":"IF(S282>0,I255,0)","v":0}]
[null,"A131","Min Side","Max Cut","Max W","Max UI","Min W",null,"Corner Cut L:",{"$f":"IF(AND(SHAPEW>0,OFFSET>0,SHAPE=$B$283),CUTOFFSET/(SIN(RADIANS(30))),0)","v":0},{"$f":"IF(AND(SHAPEW>0,OFFSET>0,SHAPE=$B$283),OFFSET/(SIN(RADIANS(30))),0)","v":0},null,null,null,null,null,null,"A124",{"$f":"IF(SHAPE=$B$248,7,0)","v":0},{"$f":"IF(S283>0,\"Max Width:\",0)","v":0},{"$f":"IF(S283>0,E249,0)","v":0},{"$f":"IF(AND(S283>0,SHAPEW>0,SHAPEW>U283),1,0)","v":0}]
[null,{"$f":"EXT","v":1},{"$f":"MINLEG","v":0},{"$f":"MAXCUT","v":0},{"$f":"MAX_W","v":0},{"$f":"MAX_UI","v":0},12,null,"Top Cut Length:",{"$f":"IF(AND(SHAPEW>0,OFFSET>0,SHAPE=$B$283),CUTOFFSET/(SIN(RADIANS(30))),0)","v":0},{"$f":"IF(AND(SHAPEW>0,OFFSET>0,SHAPE=$B$283),OFFSET/(SIN(RADIANS(30))),0)","v":0},null,null,null,null,null,null,"A124",{"$f":"IF(SHAPE=$B$248,8,0)","v":0},{"$f":"IF(S284>0,\"Max UI:\",0)","v":0},{"$f":"IF(S284>0,F249,0)","v":0},{"$f":"IF(AND(S284>0,F250>0),1,0)","v":0}]
[null,null,{"$f":"IF(AND(SHAPEW>0,OFFSET>0,SHAPE=$B$283,SHAPEW<C284),1,0)","v":0},{"$f":"IF(AND(SHAPEW>0,OFFSET>0,SHAPE=$B$283,OR(J283>D284,J284>D284)),1,0)","v":0},{"$f":"IF(AND(SHAPEW>0,OFFSET>0,SHAPE=$B$283,SHAPEW>E284),1,0)","v":0},{"$f":"IF(AND(SHAPEW>0,OFFSET>0,SHAPE=$B$283,(SHAPEW+J287)>F284),1,0)","v":0},{"$f":"IF(AND(SHAPEW>0,OFFSET>0,SHAPE=$B$283,SHAPEW<G284),1,0)","v":0},null,"Glass Width:",{"$f":"IF(AND(SHAPEW>0,OFFSET>0,SHAPE=$B$283),SHAPEW-((SQRT(K283^2-OFFSET^2))*2),0)","v":0},null,null,null,null,null,null,null,{"$f":"$B$259","v":"A127"},{"$f":"IF(SHAPE=$B$259,1,0)","v":0},{"$f":"IF(S285>0,\"Frame Radius:\",0)","v":0},{"$f":"IF(S285>0,K259,0)","v":0},{"$f":"IF(AND(S285>0,SHAPEW>0,SHAPEH>0,K259<C260),1,0)","v":0}]
[null,null,{"$f":"MAX(C285:G285)","v":0},{"$f":"IF(AND(SHAPE=$B$283,C286=1),1,0)","v":0},null,{"$f":"IF(AND(SHAPE=$B$283,J285>0,J285<GlassMinW),\"Glass Width is Under Minimum\",IF(AND(SHAPE=$B$283,J286>0,J286<GlassMinH),\"Glass Height is Under Minimum\",\"\"))","v":""},null,null,"Glass Height:",{"$f":"IF(AND(SHAPEW>0,OFFSET>0,SHAPE=$B$283),J287-OFFSET-K284,0)","v":0},null,null,null,null,null,null,null,{"$f":"$B$259","v":"A127"},{"$f":"IF(SHAPE=$B$259,2,0)","v":0},{"$f":"IF(S286>0,\"Peak Cut Length:\",0)","v":0},{"$f":"IF(S286>0,K267,0)","v":0},{"$f":"IF(AND(S286>0,U286>G260),1,0)","v":0}]
[null,null,null,null,null,null,null,null,"Frame Height:",{"$f":"IF(AND(SHAPEW>0,OFFSET>0,SHAPE=$B$283),TRUNC((SHAPEW*SIN(RADIANS(60)))*32+0.5)/32,0)","v":0},null,null,null,null,null,null,null,"A127",{"$f":"IF(SHAPE=$B$259,3,0)","v":0},{"$f":"IF(S287>0,\"Corner Cut Length:\",0)","v":0},{"$f":"IF(S287>0,K268,0)","v":0},{"$f":"IF(AND(S287>0,K268>G260),1,0)","v":0}]
[null,null,null,null,null,null,null,null,"Roof Pitch:",{"$f":"IF(AND(SHAPEW>0,OFFSET>0,SHAPE=$B$283),ROUND((TAN(RADIANS((60)))*12),1)&\" /12\",0)","v":0},null,null,null,null,null,null,null,"A127",{"$f":"IF(SHAPE=$B$259,4,0)","v":0},{"$f":"IF(S288>0,\"Glas Width:\",0)","v":0},{"$f":"IF(S288>0,K261,0)","v":0},{"$f":"IF(AND(U288>0,U288<GlassMinW),1,0)","v":0}]
[null,null,null,null,null,null,null,null,null,null,null,null,null,null,null,null,null,"A127",{"$f":"IF(SHAPE=$B$259,5,0)","v":0},{"$f":"IF(S289>0,\"Glass Height:\",0)","v":0},{"$f":"IF(S289>0,K262,0)","v":0},{"$f":"IF(AND(U289>0,U289<GlassMinH),1,0)","v":0}]
[null,null,null,null,null,null,null,null,null,null,null,null,null,null,null,null,null,"A127",{"$f":"IF(SHAPE=$B$259,6,0)","v":0},{"$f":"IF(S290>0,\"Glass Radius:\",0)","v":0},{"$f":"IF(S290>0,K260,0)","v":0}]
[null,null,null,null,null,null,null,null,null,null,null,null,null,null,null,null,null,"A127",{"$f":"IF(SHAPE=$B$259,7,0)","v":0},{"$f":"IF(S291>0,\"Max Width:\",0)","v":0},{"$f":"IF(S291>0,D260,0)","v":0},{"$f":"IF(AND(S291>0,SHAPEW>0,SHAPEW>U291),1,0)","v":0}]
[null,null,null,null,null,null,null,null,null,null,null,null,null,null,null,null,null,"A127",{"$f":"IF(SHAPE=$B$259,8,0)","v":0},{"$f":"IF(S292>0,\"Max Height:\",0)","v":0},{"$f":"IF(S292>0,E260,0)","v":0},{"$f":"IF(AND(S292>0,SHAPEH>0,SHAPEH>U292),1,0)","v":0}]
[null,null,null,null,null,null,null,null,null,null,null,null,null,null,null,null,null,"A127",{"$f":"IF(SHAPE=$B$259,9,0)","v":0},{"$f":"IF(S293>0,\"Max UI:\",0)","v":0},{"$f":"IF(S293>0,F260,0)","v":0},{"$f":"IF(AND(S293>0,F261>0),1,0)","v":0}]
[null,null,null,null,null,null,null,null,null,null,null,null,null,null,null,null,null,"A127",{"$f":"IF(SHAPE=$B$259,10,0)","v":0},{"$f":"IF(S294>0,\"Min Width:\",0)","v":0},{"$f":"IF(S294>0,H260,0)","v":0},{"$f":"IF(AND(S294>0,SHAPEH>0,SHAPEW<U294),1,0)","v":0}]
[null,null,null,null,null,null,null,null,null,null,null,null,null,null,null,null,null,{"$f":"$B$271","v":"A128"},{"$f":"IF(SHAPE=$B$271,1,0)","v":0},{"$f":"IF(S295>0,\"Frame Radius:\",0)","v":0},{"$f":"IF(S295>0,K271,0)","v":0},{"$f":"IF(AND(S295>0,SHAPEW>0,SHAPEH>0,DIM_4>0,K271<C272),1,0)","v":0}]
[null,null,null,null,null,null,null,null,null,null,null,null,null,null,null,null,null,{"$f":"$B$271","v":"A128"},{"$f":"IF(SHAPE=$B$271,2,0)","v":0},{"$f":"IF(S296>0,\"Frame Leg:\",0)","v":0},{"$f":"IF(S296>0,DIM_4,0)","v":0},{"$f":"IF(AND(S296>0,DIM_4>0,F273>0),1,0)","v":0}]
[null,null,null,null,null,null,null,null,null,null,null,null,null,null,null,null,null,"A128",{"$f":"IF(SHAPE=$B$271,3,0)","v":0},{"$f":"IF(S297>0,\"Peak Cut Length:\",0)","v":0},{"$f":"IF(S297>0,K280,0)","v":0},{"$f":"IF(AND(S297>0,U297>H272),1,0)","v":0}]
[null,null,null,null,null,null,null,null,null,null,null,null,null,null,null,null,null,"A128",{"$f":"IF(SHAPE=$B$271,4,0)","v":0},{"$f":"IF(S298>0,\"Corner Cut Length:\",0)","v":0},{"$f":"IF(S298>0,K281,0)","v":0},{"$f":"IF(AND(S298>0,U298>H272),1,0)","v":0}]
[null,null,null,null,null,null,null,null,null,null,null,null,null,null,null,null,null,"A128",{"$f":"IF(SHAPE=$B$271,5,0)","v":0},{"$f":"IF(S299>0,\"Glas Width:\",0)","v":0},{"$f":"IF(S299>0,K273,0)","v":0},{"$f":"IF(AND(U299>0,U299<GlassMinW),1,0)","v":0}]
[null,null,null,null,null,null,null,null,null,null,null,null,null,null,null,null,null,"A128",{"$f":"IF(SHAPE=$B$271,6,0)","v":0},{"$f":"IF(S300>0,\"Glass Height:\",0)","v":0},{"$f":"IF(S300>0,K274,0)","v":0},{"$f":"IF(AND(U300>0,U300<GlassMinH),1,0)","v":0}]
[null,null,null,null,null,null,null,null,null,null,null,null,null,null,null,null,null,"A128",{"$f":"IF(SHAPE=$B$271,7,0)","v":0},{"$f":"IF(S301>0,\"Glass Radius:\",0)","v":0},{"$f":"IF(S301>0,K272,0)","v":0}]
[null,null,null,null,null,null,null,null,null,null,null,null,null,null,null,null,null,"A128",{"$f":"IF(SHAPE=$B$271,8,0)","v":0},{"$f":"IF(S302>0,\"Glass Leg:\",0)","v":0},{"$f":"IF(S302>0,K275,0)","v":0}]
[null,null,null,null,null,null,null,null,null,null,null,null,null,null,null,null,null,"A128",{"$f":"IF(SHAPE=$B$271,9,0)","v":0},{"$f":"IF(S303>0,\"Max Width:\",0)","v":0},{"$f":"IF(S303>0,D272,0)","v":0},{"$f":"IF(AND(S303>0,SHAPEW>0,SHAPEW>U303),1,0)","v":0}]
[null,null,null,null,null,null,null,null,null,null,null,null,null,null,null,null,null,"A128",{"$f":"IF(SHAPE=$B$271,10,0)","v":0},{"$f":"IF(S304>0,\"Min Width:\",0)","v":0},{"$f":"IF(S304>0,I272,0)","v":0},{"$f":"IF(AND(S304>0,SHAPEH>0,SHAPEW<U304),1,0)","v":0}]
[null,null,null,null,null,null,null,null,null,null,null,null,null,null,null,null,null,"A128",{"$f":"IF(SHAPE=$B$271,11,0)","v":0},{"$f":"IF(S305>0,\"Max Height:\",0)","v":0},{"$f":"IF(S305>0,E272,0)","v":0},{"$f":"IF(AND(S305>0,SHAPEH>0,SHAPEH>U305),1,0)","v":0}]
[null,null,null,null,null,null,null,null,null,null,null,null,null,null,null,null,null,"A128",{"$f":"IF(SHAPE=$B$271,12,0)","v":0},{"$f":"IF(S306>0,\"Max UI:\",0)","v":0},{"$f":"IF(S306>0,G272,0)","v":0},{"$f":"IF(AND(S306>0,G273>0),1,0)","v":0}]
[null,null,null,null,null,null,null,null,null,null,null,null,null,null,null,null,null,{"$f":"$B$283","v":"A131"},{"$f":"IF(SHAPE=$B$283,1,0)","v":0},{"$f":"IF(S307>0,\"Roof Pitch:\",0)","v":0},{"$f":"IF(S307>0,J288,0)","v":0}]
[null,null,null,null,null,null,null,null,null,null,null,null,null,null,null,null,null,{"$f":"$B$283","v":"A131"},{"$f":"IF(SHAPE=$B$283,2,0)","v":0},{"$f":"IF(S308>0,\"Frame Height:\",0)","v":0},{"$f":"IF(S308>0,J287,0)","v":0}]
[null,null,null,null,null,null,null,null,null,null,null,null,null,null,null,null,null,"A131",{"$f":"IF(SHAPE=$B$283,3,0)","v":0},{"$f":"IF(S309>0,\"All Cut Length:\",0)","v":0},{"$f":"IF(S309>0,J283,0)","v":0},{"$f":"IF(AND(S309>0,D285>0),1,0)","v":0}]
[null,null,null,null,null,null,null,null,null,null,null,null,null,null,null,null,null,"A131",{"$f":"IF(SHAPE=$B$283,4,0)","v":0},{"$f":"IF(S310>0,\"All Cut Angles:\",0)","v":0},{"$f":"IF(S310>0,30,0)","v":0}]
[null,null,null,null,null,null,null,null,null,null,null,null,null,null,null,null,null,"A131",{"$f":"IF(SHAPE=$B$283,5,0)","v":0},{"$f":"IF(S311>0,\"Glass Width:\",0)","v":0},{"$f":"IF(S311>0,J285,0)","v":0},{"$f":"IF(AND(U311>0,U311<GlassMinW),1,0)","v":0}]
[null,null,null,null,null,null,null,null,null,null,null,null,null,null,null,null,null,"A131",{"$f":"IF(SHAPE=$B$283,6,0)","v":0},{"$f":"IF(S312>0,\"Glass Height:\",0)","v":0},{"$f":"IF(S312>0,J286,0)","v":0},{"$f":"IF(AND(U312>0,U312<GlassMinH),1,0)","v":0}]
[null,null,null,null,null,null,null,null,null,null,null,null,null,null,null,null,null,"A131",{"$f":"IF(SHAPE=$B$283,7,0)","v":0},{"$f":"IF(S313>0,\"Max Width:\",0)","v":0},{"$f":"IF(S313>0,E284,0)","v":0},{"$f":"IF(AND(S313>0,SHAPEW>0,SHAPEW>U313),1,0)","v":0}]
[null,null,null,null,null,null,null,null,null,null,null,null,null,null,null,null,null,"A131",{"$f":"IF(SHAPE=$B$283,8,0)","v":0},{"$f":"IF(S314>0,\"Max UI:\",0)","v":0},{"$f":"IF(S314>0,F284,0)","v":0},{"$f":"IF(AND(S314>0,F285>0),1,0)","v":0}]
[null,null,null,null,null,null,null,null,null,null,null,null,null,null,null,null,null,"A131",{"$f":"IF(SHAPE=$B$283,9,0)","v":0},{"$f":"IF(S315>0,\"Min Width:\",0)","v":0},{"$f":"IF(S315>0,G284,0)","v":0},{"$f":"IF(AND(S315>0,SHAPEW>0,G285>0),1,0)","v":0}]

{"sheet":"Data","index":2,"n_rows":156,"n_cols":83,"rows_kept":156,"cut":false,"hidden":true,"merged":[]}
[]
[null,"Min. Width","A77A","A77B","A77C","A77D","A77G","A77H","A77J","A77K","A77L","A77N","A77P","A77Q","A77R","A77S","A77U","A77V","A77W","A77Y","A77Z","A78A","A78B","A78C","A78D","A78G","A78H","A78J","A78K","A78L","A78N","A78P","A78Q","A78R","A78S","A78U","A78V","A78W","A78Y","A78Z","A79A","A79B","A79C","A79D","A79G","A79H","A79J","A79K","A79L","A79N","A79P","A79Q","A79R","A79S","A79U","A79V","A79W","A79Y","A79Z","A105","A110","A111","A112","A113","A114","A115","A116","A117","A118","A119","A120","A121","A122","A123","A124","A125","A126","A127","A128","A129","A130","A131","A132"]
[null,"Mezzo",null,null,null,null,null,null,null,null,null,null,null,null,null,null,null,null,null,null,null,null,null,null,null,null,null,null,null,null,null,null,null,null,null,null,null,null,null,null,null,null,null,null,null,null,null,null,null,null,null,null,null,null,null,null,null,null,null,25,25,12.5,12.5,25,14,13,13,36,24,29,18,18,18,18,12,18,18,18,18,12,16,15,14]
[null,"Mezzo w/ NF",null,null,null,null,null,null,null,null,null,null,null,null,null,null,null,null,null,null,null,null,null,null,null,null,null,null,null,null,null,null,null,null,null,null,null,null,null,null,null,null,null,null,null,null,null,null,null,null,null,null,null,null,null,null,null,null,null,25,25,12.5,12.5,25,14,13,13,36,24,29,18,18,18,18,12,18,18,18,18,12,16,15,14]
[null,"Mezzo w/ Stucco",null,null,null,null,null,null,null,null,null,null,null,null,null,null,null,null,null,null,null,null,null,null,null,null,null,null,null,null,null,null,null,null,null,null,null,null,null,null,null,null,null,null,null,null,null,null,null,null,null,null,null,null,null,null,null,null,null,27,27,13.5,13.5,25,14,13.5,13.5,36,24,29,18,18,18,18,12,18,18,18,18,12,16,15,14]
[null,"Platinum",null,null,null,null,null,null,null,null,null,null,null,null,null,null,null,null,null,null,null,null,null,null,null,null,null,null,null,null,null,null,null,null,null,null,null,null,null,null,null,null,null,null,null,null,null,null,null,null,null,null,null,null,null,null,null,null,null,20,20,11.5,11.5,20,12,13,13,36,20,24,16,16,16,16,12,18,18,18,18,12,16,15,14]
[null,"Platinum w/ Stucco",null,null,null,null,null,null,null,null,null,null,null,null,null,null,null,null,null,null,null,null,null,null,null,null,null,null,null,null,null,null,null,null,null,null,null,null,null,null,null,null,null,null,null,null,null,null,null,null,null,null,null,null,null,null,null,null,null,20,20,11.5,11.5,20,12,13,13,36,20,24,16,16,16,16,12,18,18,18,18,12,16,15,14]
[null,"70 - Frame w/ 1-3/8\" NFS",20,20,10,20,16,12,12,20,10,10,10,10,18,12,10,15,10,12,12]
[null,"70 - Frame w/ 7/8\" NFS",20,20,10,20,16,12,12,20,10,10,10,10,18,12,10,15,10,12,12]
[null,"70 - Frame w/ J-Channel",20,20,10,20,16,12,12,20,10,10,10,10,18,12,10,15,10,12,12]
[null,"70 - Frame w/ Stucco",23.5,23.5,11.75,23.5,16,12,12,25,11.75,12,12,12,23.5,12,12,15,10,12,12]
[null,"80/90 - Frame w/ 1-3/8\" NFS",null,null,null,null,null,null,null,null,null,null,null,null,null,null,null,null,null,null,null,23.5,23.5,11.75,23.5,16,12,12,25,11.75,12,12,12,23.5,12,12,15,10,12,12,23.5,23.5,11.75,23.5,16,12,12,25,11.75,12,12,12,23.5,12,12,15,10,12,12]
[null,"80/90 - Frame w/ 1\" NFS",null,null,null,null,null,null,null,null,null,null,null,null,null,null,null,null,null,null,null,23.5,23.5,11.75,23.5,16,12,12,25,11.75,12,12,12,23.5,12,12,15,10,12,12,23.5,23.5,11.75,23.5,16,12,12,25,11.75,12,12,12,23.5,12,12,15,10,12,12]
[null,"80/90 - Frame w/ Stucco",null,null,null,null,null,null,null,null,null,null,null,null,null,null,null,null,null,null,null,23.5,23.5,11.75,23.5,16,12,12,25,11.75,12,12,12,23.5,12,12,15,10,12,12,23.5,23.5,11.75,23.5,16,12,12,25,11.75,12,12,12,23.5,12,12,15,10,12,12]
[null,null,{"$f":"IF(EXTR>1,VLOOKUP(EXTSELECT,MINWIDTHTABLE,2,FALSE),0)","v":0},{"$f":"IF(EXTR>1,VLOOKUP(EXTSELECT,MINWIDTHTABLE,3,FALSE),0)","v":0},{"$f":"IF(EXTR>1,VLOOKUP(EXTSELECT,MINWIDTHTABLE,4,FALSE),0)","v":0},{"$f":"IF(EXTR>1,VLOOKUP(EXTSELECT,MINWIDTHTABLE,5,FALSE),0)","v":0},{"$f":"IF(EXTR>1,VLOOKUP(EXTSELECT,MINWIDTHTABLE,6,FALSE),0)","v":0},{"$f":"IF(EXTR>1,VLOOKUP(EXTSELECT,MINWIDTHTABLE,7,FALSE),0)","v":0},{"$f":"IF(EXTR>1,VLOOKUP(EXTSELECT,MINWIDTHTABLE,8,FALSE),0)","v":0},{"$f":"IF(EXTR>1,VLOOKUP(EXTSELECT,MINWIDTHTABLE,9,FALSE),0)","v":0},{"$f":"IF(EXTR>1,VLOOKUP(EXTSELECT,MINWIDTHTABLE,10,FALSE),0)","v":0},{"$f":"IF(EXTR>1,VLOOKUP(EXTSELECT,MINWIDTHTABLE,11,FALSE),0)","v":0},{"$f":"IF(EXTR>1,VLOOKUP(EXTSELECT,MINWIDTHTABLE,12,FALSE),0)","v":0},{"$f":"IF(EXTR>1,VLOOKUP(EXTSELECT,MINWIDTHTABLE,13,FALSE),0)","v":0},{"$f":"IF(EXTR>1,VLOOKUP(EXTSELECT,MINWIDTHTABLE,14,FALSE),0)","v":0},{"$f":"IF(EXTR>1,VLOOKUP(EXTSELECT,MINWIDTHTABLE,15,FALSE),0)","v":0},{"$f":"IF(EXTR>1,VLOOKUP(EXTSELECT,MINWIDTHTABLE,16,FALSE),0)","v":0},{"$f":"IF(EXTR>1,VLOOKUP(EXTSELECT,MINWIDTHTABLE,17,FALSE),0)","v":0},{"$f":"IF(EXTR>1,VLOOKUP(EXTSELECT,MINWIDTHTABLE,18,FALSE),0)","v":0},{"$f":"IF(EXTR>1,VLOOKUP(EXTSELECT,MINWIDTHTABLE,19,FALSE),0)","v":0},{"$f":"IF(EXTR>1,VLOOKUP(EXTSELECT,MINWIDTHTABLE,20,FALSE),0)","v":0},{"$f":"IF(EXTR>1,VLOOKUP(EXTSELECT,MINWIDTHTABLE,21,FALSE),0)","v":0},{"$f":"IF(EXTR>1,VLOOKUP(EXTSELECT,MINWIDTHTABLE,22,FALSE),0)","v":0},{"$f":"IF(EXTR>1,VLOOKUP(EXTSELECT,MINWIDTHTABLE,23,FALSE),0)","v":0},{"$f":"IF(EXTR>1,VLOOKUP(EXTSELECT,MINWIDTHTABLE,24,FALSE),0)","v":0},{"$f":"IF(EXTR>1,VLOOKUP(EXTSELECT,MINWIDTHTABLE,25,FALSE),0)","v":0},{"$f":"IF(EXTR>1,VLOOKUP(EXTSELECT,MINWIDTHTABLE,26,FALSE),0)","v":0},{"$f":"IF(EXTR>1,VLOOKUP(EXTSELECT,MINWIDTHTABLE,27,FALSE),0)","v":0},{"$f":"IF(EXTR>1,VLOOKUP(EXTSELECT,MINWIDTHTABLE,28,FALSE),0)","v":0},{"$f":"IF(EXTR>1,VLOOKUP(EXTSELECT,MINWIDTHTABLE,29,FALSE),0)","v":0},{"$f":"IF(EXTR>1,VLOOKUP(EXTSELECT,MINWIDTHTABLE,30,FALSE),0)","v":0},{"$f":"IF(EXTR>1,VLOOKUP(EXTSELECT,MINWIDTHTABLE,31,FALSE),0)","v":0},{"$f":"IF(EXTR>1,VLOOKUP(EXTSELECT,MINWIDTHTABLE,32,FALSE),0)","v":0},{"$f":"IF(EXTR>1,VLOOKUP(EXTSELECT,MINWIDTHTABLE,33,FALSE),0)","v":0},{"$f":"IF(EXTR>1,VLOOKUP(EXTSELECT,MINWIDTHTABLE,34,FALSE),0)","v":0},{"$f":"IF(EXTR>1,VLOOKUP(EXTSELECT,MINWIDTHTABLE,35,FALSE),0)","v":0},{"$f":"IF(EXTR>1,VLOOKUP(EXTSELECT,MINWIDTHTABLE,36,FALSE),0)","v":0},{"$f":"IF(EXTR>1,VLOOKUP(EXTSELECT,MINWIDTHTABLE,37,FALSE),0)","v":0},{"$f":"IF(EXTR>1,VLOOKUP(EXTSELECT,MINWIDTHTABLE,38,FALSE),0)","v":0},{"$f":"IF(EXTR>1,VLOOKUP(EXTSELECT,MINWIDTHTABLE,39,FALSE),0)","v":0},{"$f":"IF(EXTR>1,VLOOKUP(EXTSELECT,MINWIDTHTABLE,40,FALSE),0)","v":0},{"$f":"IF(EXTR>1,VLOOKUP(EXTSELECT,MINWIDTHTABLE,41,FALSE),0)","v":0},{"$f":"IF(EXTR>1,VLOOKUP(EXTSELECT,MINWIDTHTABLE,42,FALSE),0)","v":0},{"$f":"IF(EXTR>1,VLOOKUP(EXTSELECT,MINWIDTHTABLE,43,FALSE),0)","v":0},{"$f":"IF(EXTR>1,VLOOKUP(EXTSELECT,MINWIDTHTABLE,44,FALSE),0)","v":0},{"$f":"IF(EXTR>1,VLOOKUP(EXTSELECT,MINWIDTHTABLE,45,FALSE),0)","v":0},{"$f":"IF(EXTR>1,VLOOKUP(EXTSELECT,MINWIDTHTABLE,46,FALSE),0)","v":0},{"$f":"IF(EXTR>1,VLOOKUP(EXTSELECT,MINWIDTHTABLE,47,FALSE),0)","v":0},{"$f":"IF(EXTR>1,VLOOKUP(EXTSELECT,MINWIDTHTABLE,48,FALSE),0)","v":0},{"$f":"IF(EXTR>1,VLOOKUP(EXTSELECT,MINWIDTHTABLE,49,FALSE),0)","v":0},{"$f":"IF(EXTR>1,VLOOKUP(EXTSELECT,MINWIDTHTABLE,50,FALSE),0)","v":0},{"$f":"IF(EXTR>1,VLOOKUP(EXTSELECT,MINWIDTHTABLE,51,FALSE),0)","v":0},{"$f":"IF(EXTR>1,VLOOKUP(EXTSELECT,MINWIDTHTABLE,52,FALSE),0)","v":0},{"$f":"IF(EXTR>1,VLOOKUP(EXTSELECT,MINWIDTHTABLE,53,FALSE),0)","v":0},{"$f":"IF(EXTR>1,VLOOKUP(EXTSELECT,MINWIDTHTABLE,54,FALSE),0)","v":0},{"$f":"IF(EXTR>1,VLOOKUP(EXTSELECT,MINWIDTHTABLE,55,FALSE),0)","v":0},{"$f":"IF(EXTR>1,VLOOKUP(EXTSELECT,MINWIDTHTABLE,56,FALSE),0)","v":0},{"$f":"IF(EXTR>1,VLOOKUP(EXTSELECT,MINWIDTHTABLE,57,FALSE),0)","v":0},{"$f":"IF(EXTR>1,VLOOKUP(EXTSELECT,MINWIDTHTABLE,58,FALSE),0)","v":0},{"$f":"IF(EXTR>1,VLOOKUP(EXTSELECT,MINWIDTHTABLE,59,FALSE),0)","v":0},{"$f":"IF(EXTR>1,VLOOKUP(EXTSELECT,MINWIDTHTABLE,60,FALSE),0)","v":0},{"$f":"IF(EXTR>1,VLOOKUP(EXTSELECT,MINWIDTHTABLE,61,FALSE),0)","v":0},{"$f":"IF(EXTR>1,VLOOKUP(EXTSELECT,MINWIDTHTABLE,62,FALSE),0)","v":0},{"$f":"IF(EXTR>1,VLOOKUP(EXTSELECT,MINWIDTHTABLE,63,FALSE),0)","v":0},{"$f":"IF(EXTR>1,VLOOKUP(EXTSELECT,MINWIDTHTABLE,64,FALSE),0)","v":0},{"$f":"IF(EXTR>1,VLOOKUP(EXTSELECT,MINWIDTHTABLE,65,FALSE),0)","v":0},{"$f":"IF(EXTR>1,VLOOKUP(EXTSELECT,MINWIDTHTABLE,66,FALSE),0)","v":0},{"$f":"IF(EXTR>1,VLOOKUP(EXTSELECT,MINWIDTHTABLE,67,FALSE),0)","v":0},{"$f":"IF(EXTR>1,VLOOKUP(EXTSELECT,MINWIDTHTABLE,68,FALSE),0)","v":0},{"$f":"IF(EXTR>1,VLOOKUP(EXTSELECT,MINWIDTHTABLE,69,FALSE),0)","v":0},{"$f":"IF(EXTR>1,VLOOKUP(EXTSELECT,MINWIDTHTABLE,70,FALSE),0)","v":0},{"$f":"IF(EXTR>1,VLOOKUP(EXTSELECT,MINWIDTHTABLE,71,FALSE),0)","v":0},{"$f":"IF(EXTR>1,VLOOKUP(EXTSELECT,MINWIDTHTABLE,72,FALSE),0)","v":0},{"$f":"IF(EXTR>1,VLOOKUP(EXTSELECT,MINWIDTHTABLE,73,FALSE),0)","v":0},{"$f":"IF(EXTR>1,VLOOKUP(EXTSELECT,MINWIDTHTABLE,74,FALSE),0)","v":0},{"$f":"IF(EXTR>1,VLOOKUP(EXTSELECT,MINWIDTHTABLE,75,FALSE),0)","v":0},{"$f":"IF(EXTR>1,VLOOKUP(EXTSELECT,MINWIDTHTABLE,76,FALSE),0)","v":0},{"$f":"IF(EXTR>1,VLOOKUP(EXTSELECT,MINWIDTHTABLE,77,FALSE),0)","v":0},{"$f":"IF(EXTR>1,VLOOKUP(EXTSELECT,MINWIDTHTABLE,78,FALSE),0)","v":0},{"$f":"IF(EXTR>1,VLOOKUP(EXTSELECT,MINWIDTHTABLE,79,FALSE),0)","v":0},{"$f":"IF(EXTR>1,VLOOKUP(EXTSELECT,MINWIDTHTABLE,80,FALSE),0)","v":0},{"$f":"IF(EXTR>1,VLOOKUP(EXTSELECT,MINWIDTHTABLE,81,FALSE),0)","v":0},{"$f":"IF(EXTR>1,VLOOKUP(EXTSELECT,MINWIDTHTABLE,82,FALSE),0)","v":0}]
[null,"Min. Height","A77A","A77B","A77C","A77D","A77G","A77H","A77J","A77K","A77L","A77N","A77P","A77Q","A77R","A77S","A77U","A77V","A77W","A77Y","A77Z","A78A","A78B","A78C","A78D","A78G","A78H","A78J","A78K","A78L","A78N","A78P","A78Q","A78R","A78S","A78U","A78V","A78W","A78Y","A78Z","A79A","A79B","A79C","A79D","A79G","A79H","A79J","A79K","A79L","A79N","A79P","A79Q","A79R","A79S","A79U","A79V","A79W","A79Y","A79Z","A105","A110","A111","A112","A113","A114","A115","A116","A117","A118","A119","A120","A121","A122","A123","A124","A125","A126","A127","A128","A129","A130","A131","A132"]
[null,"Mezzo",null,null,null,null,null,null,null,null,null,null,null,null,null,null,null,null,null,null,null,null,null,null,null,null,null,null,null,null,null,null,null,null,null,null,null,null,null,null,null,null,null,null,null,null,null,null,null,null,null,null,null,null,null,null,null,null,null,12.5,12.75,12.5,12.75,{"$f":"TRUNC((SQRT(SHAPEW+7.25)*16+0.5)/16)+(2*2.09375)","v":6.1875},12,{"$f":"TRUNC((SQRT(SHAPEW+7.25)*16+0.5)/16)+(2*2.09375)","v":6.1875},13,15,24,29,18,18,18,18,18.4375,18,18,18,24,12,16,13,12]
[null,"Mezzo w/ NF",null,null,null,null,null,null,null,null,null,null,null,null,null,null,null,null,null,null,null,null,null,null,null,null,null,null,null,null,null,null,null,null,null,null,null,null,null,null,null,null,null,null,null,null,null,null,null,null,null,null,null,null,null,null,null,null,null,12.5,12.75,12.5,12.75,{"$f":"TRUNC((SQRT(SHAPEW+7.25)*16+0.5)/16)+(2*2.09375)","v":6.1875},12,{"$f":"TRUNC((SQRT(SHAPEW+7.25)*16+0.5)/16)+(2*2.09375)","v":6.1875},13,15,24,29,18,18,18,18,18.4375,18,18,18,24,12,16,13,12]
[null,"Mezzo w/ Stucco",null,null,null,null,null,null,null,null,null,null,null,null,null,null,null,null,null,null,null,null,null,null,null,null,null,null,null,null,null,null,null,null,null,null,null,null,null,null,null,null,null,null,null,null,null,null,null,null,null,null,null,null,null,null,null,null,null,13.5,13.75,13.5,13.75,{"$f":"TRUNC((SQRT(SHAPEW+7.25)*16+0.5)/16)+(2*2.09375)","v":6.1875},12,{"$f":"TRUNC((SQRT(SHAPEW+7.25)*16+0.5)/16)+(2*2.09375)","v":6.1875},13.5,16,24,29,18,18,18,18,18.4375,18,18,18,24,12,16,13,12]
[null,"Platinum",null,null,null,null,null,null,null,null,null,null,null,null,null,null,null,null,null,null,null,null,null,null,null,null,null,null,null,null,null,null,null,null,null,null,null,null,null,null,null,null,null,null,null,null,null,null,null,null,null,null,null,null,null,null,null,null,null,10,12.25,11.5,11.75,{"$f":"TRUNC((SQRT(SHAPEW+7.25)*16+0.5)/16)+(2*1.125)","v":4.25},12,{"$f":"TRUNC((SQRT(SHAPEW+7.25)*16+0.5)/16)+(2*1.125)","v":4.25},13,13,20,24,16,16,16,16,18.4375,18,18,18,24,12,16,13,12]
[null,"Platinum w/ Stucco",null,null,null,null,null,null,null,null,null,null,null,null,null,null,null,null,null,null,null,null,null,null,null,null,null,null,null,null,null,null,null,null,null,null,null,null,null,null,null,null,null,null,null,null,null,null,null,null,null,null,null,null,null,null,null,null,null,10,12.25,11.5,11.75,{"$f":"TRUNC((SQRT(SHAPEW+7.25)*16+0.5)/16)+(2*1.125)","v":4.25},12,{"$f":"TRUNC((SQRT(SHAPEW+7.25)*16+0.5)/16)+(2*1.125)","v":4.25},13,13,20,24,16,16,16,16,18.4375,18,18,18,24,12,16,13,12]
[null,"70 - Frame w/ 1-3/8\" NFS",20,10,10,20,16,8,9,{"$f":"TRUNC((SQRT(SHAPEW+7.25)*16+0.5)/16)+(2*1.15625)","v":4.3125},4.3125,10,10,10,10,12,11,10,10,12,12]
[null,"70 - Frame w/ 7/8\" NFS",20,10,10,20,16,8,9,4.3125,4.3125,10,10,10,10,12,11,10,10,12,12]
[null,"70 - Frame w/ J-Channel",20,10,10,20,16,8,9,4.3125,4.3125,10,10,10,10,12,11,10,10,12,12]
[null,"70 - Frame w/ Stucco",23.5,11.75,11.75,23.5,16,10,10,4.3125,4.3125,12,12,12,12,12,13,10,10,12,12]
[null,"80/90 - Frame w/ 1-3/8\" NFS",null,null,null,null,null,null,null,null,null,null,null,null,null,null,null,null,null,null,null,23.5,11.75,11.75,23.5,16,10,10,{"$f":"TRUNC((SQRT(SHAPEW+7.25)*16+0.5)/16)+(2*1.28125)","v":4.5625},4.5625,12,12,12,12,12,13,10,10,12,12,23.5,11.75,11.75,23.5,16,10,10,{"$f":"TRUNC((SQRT(SHAPEW+7.25)*16+0.5)/16)+(2*1.28125)","v":4.5625},4.5625,12,12,12,12,12,13,10,10,12,12]
[null,"80/90 - Frame w/ 1\" NFS",null,null,null,null,null,null,null,null,null,null,null,null,null,null,null,null,null,null,null,23.5,11.75,11.75,23.5,16,10,10,4.5625,4.5625,12,12,12,12,12,13,10,10,12,12,23.5,11.75,11.75,23.5,16,10,10,4.5625,4.5625,12,12,12,12,12,13,10,10,12,12]
[null,"80/90 - Frame w/ Stucco",null,null,null,null,null,null,null,null,null,null,null,null,null,null,null,null,null,null,null,23.5,11.75,11.75,23.5,16,10,10,4.5625,4.5625,12,12,12,12,12,13,10,10,12,12,23.5,11.75,11.75,23.5,16,10,10,4.5625,4.5625,12,12,12,12,12,13,10,10,12,12]
[null,null,{"$f":"IF(EXTR>1,VLOOKUP(EXTSELECT,MINHEIGHTTABLE,2,FALSE),0)","v":0},{"$f":"IF(EXTR>1,VLOOKUP(EXTSELECT,MINHEIGHTTABLE,3,FALSE),0)","v":0},{"$f":"IF(EXTR>1,VLOOKUP(EXTSELECT,MINHEIGHTTABLE,4,FALSE),0)","v":0},{"$f":"IF(EXTR>1,VLOOKUP(EXTSELECT,MINHEIGHTTABLE,5,FALSE),0)","v":0},{"$f":"IF(EXTR>1,VLOOKUP(EXTSELECT,MINHEIGHTTABLE,6,FALSE),0)","v":0},{"$f":"IF(EXTR>1,VLOOKUP(EXTSELECT,MINHEIGHTTABLE,7,FALSE),0)","v":0},{"$f":"IF(EXTR>1,VLOOKUP(EXTSELECT,MINHEIGHTTABLE,8,FALSE),0)","v":0},{"$f":"IF(EXTR>1,VLOOKUP(EXTSELECT,MINHEIGHTTABLE,9,FALSE),0)","v":0},{"$f":"IF(EXTR>1,VLOOKUP(EXTSELECT,MINHEIGHTTABLE,10,FALSE),0)","v":0},{"$f":"IF(EXTR>1,VLOOKUP(EXTSELECT,MINHEIGHTTABLE,11,FALSE),0)","v":0},{"$f":"IF(EXTR>1,VLOOKUP(EXTSELECT,MINHEIGHTTABLE,12,FALSE),0)","v":0},{"$f":"IF(EXTR>1,VLOOKUP(EXTSELECT,MINHEIGHTTABLE,13,FALSE),0)","v":0},{"$f":"IF(EXTR>1,VLOOKUP(EXTSELECT,MINHEIGHTTABLE,14,FALSE),0)","v":0},{"$f":"IF(EXTR>1,VLOOKUP(EXTSELECT,MINHEIGHTTABLE,15,FALSE),0)","v":0},{"$f":"IF(EXTR>1,VLOOKUP(EXTSELECT,MINHEIGHTTABLE,16,FALSE),0)","v":0},{"$f":"IF(EXTR>1,VLOOKUP(EXTSELECT,MINHEIGHTTABLE,17,FALSE),0)","v":0},{"$f":"IF(EXTR>1,VLOOKUP(EXTSELECT,MINHEIGHTTABLE,18,FALSE),0)","v":0},{"$f":"IF(EXTR>1,VLOOKUP(EXTSELECT,MINHEIGHTTABLE,19,FALSE),0)","v":0},{"$f":"IF(EXTR>1,VLOOKUP(EXTSELECT,MINHEIGHTTABLE,20,FALSE),0)","v":0},{"$f":"IF(EXTR>1,VLOOKUP(EXTSELECT,MINHEIGHTTABLE,21,FALSE),0)","v":0},{"$f":"IF(EXTR>1,VLOOKUP(EXTSELECT,MINHEIGHTTABLE,22,FALSE),0)","v":0},{"$f":"IF(EXTR>1,VLOOKUP(EXTSELECT,MINHEIGHTTABLE,23,FALSE),0)","v":0},{"$f":"IF(EXTR>1,VLOOKUP(EXTSELECT,MINHEIGHTTABLE,24,FALSE),0)","v":0},{"$f":"IF(EXTR>1,VLOOKUP(EXTSELECT,MINHEIGHTTABLE,25,FALSE),0)","v":0},{"$f":"IF(EXTR>1,VLOOKUP(EXTSELECT,MINHEIGHTTABLE,26,FALSE),0)","v":0},{"$f":"IF(EXTR>1,VLOOKUP(EXTSELECT,MINHEIGHTTABLE,27,FALSE),0)","v":0},{"$f":"IF(EXTR>1,VLOOKUP(EXTSELECT,MINHEIGHTTABLE,28,FALSE),0)","v":0},{"$f":"IF(EXTR>1,VLOOKUP(EXTSELECT,MINHEIGHTTABLE,29,FALSE),0)","v":0},{"$f":"IF(EXTR>1,VLOOKUP(EXTSELECT,MINHEIGHTTABLE,30,FALSE),0)","v":0},{"$f":"IF(EXTR>1,VLOOKUP(EXTSELECT,MINHEIGHTTABLE,31,FALSE),0)","v":0},{"$f":"IF(EXTR>1,VLOOKUP(EXTSELECT,MINHEIGHTTABLE,32,FALSE),0)","v":0},{"$f":"IF(EXTR>1,VLOOKUP(EXTSELECT,MINHEIGHTTABLE,33,FALSE),0)","v":0},{"$f":"IF(EXTR>1,VLOOKUP(EXTSELECT,MINHEIGHTTABLE,34,FALSE),0)","v":0},{"$f":"IF(EXTR>1,VLOOKUP(EXTSELECT,MINHEIGHTTABLE,35,FALSE),0)","v":0},{"$f":"IF(EXTR>1,VLOOKUP(EXTSELECT,MINHEIGHTTABLE,36,FALSE),0)","v":0},{"$f":"IF(EXTR>1,VLOOKUP(EXTSELECT,MINHEIGHTTABLE,37,FALSE),0)","v":0},{"$f":"IF(EXTR>1,VLOOKUP(EXTSELECT,MINHEIGHTTABLE,38,FALSE),0)","v":0},{"$f":"IF(EXTR>1,VLOOKUP(EXTSELECT,MINHEIGHTTABLE,39,FALSE),0)","v":0},{"$f":"IF(EXTR>1,VLOOKUP(EXTSELECT,MINHEIGHTTABLE,40,FALSE),0)","v":0},{"$f":"IF(EXTR>1,VLOOKUP(EXTSELECT,MINHEIGHTTABLE,41,FALSE),0)","v":0},{"$f":"IF(EXTR>1,VLOOKUP(EXTSELECT,MINHEIGHTTABLE,42,FALSE),0)","v":0},{"$f":"IF(EXTR>1,VLOOKUP(EXTSELECT,MINHEIGHTTABLE,43,FALSE),0)","v":0},{"$f":"IF(EXTR>1,VLOOKUP(EXTSELECT,MINHEIGHTTABLE,44,FALSE),0)","v":0},{"$f":"IF(EXTR>1,VLOOKUP(EXTSELECT,MINHEIGHTTABLE,45,FALSE),0)","v":0},{"$f":"IF(EXTR>1,VLOOKUP(EXTSELECT,MINHEIGHTTABLE,46,FALSE),0)","v":0},{"$f":"IF(EXTR>1,VLOOKUP(EXTSELECT,MINHEIGHTTABLE,47,FALSE),0)","v":0},{"$f":"IF(EXTR>1,VLOOKUP(EXTSELECT,MINHEIGHTTABLE,48,FALSE),0)","v":0},{"$f":"IF(EXTR>1,VLOOKUP(EXTSELECT,MINHEIGHTTABLE,49,FALSE),0)","v":0},{"$f":"IF(EXTR>1,VLOOKUP(EXTSELECT,MINHEIGHTTABLE,50,FALSE),0)","v":0},{"$f":"IF(EXTR>1,VLOOKUP(EXTSELECT,MINHEIGHTTABLE,51,FALSE),0)","v":0},{"$f":"IF(EXTR>1,VLOOKUP(EXTSELECT,MINHEIGHTTABLE,52,FALSE),0)","v":0},{"$f":"IF(EXTR>1,VLOOKUP(EXTSELECT,MINHEIGHTTABLE,53,FALSE),0)","v":0},{"$f":"IF(EXTR>1,VLOOKUP(EXTSELECT,MINHEIGHTTABLE,54,FALSE),0)","v":0},{"$f":"IF(EXTR>1,VLOOKUP(EXTSELECT,MINHEIGHTTABLE,55,FALSE),0)","v":0},{"$f":"IF(EXTR>1,VLOOKUP(EXTSELECT,MINHEIGHTTABLE,56,FALSE),0)","v":0},{"$f":"IF(EXTR>1,VLOOKUP(EXTSELECT,MINHEIGHTTABLE,57,FALSE),0)","v":0},{"$f":"IF(EXTR>1,VLOOKUP(EXTSELECT,MINHEIGHTTABLE,58,FALSE),0)","v":0},{"$f":"IF(EXTR>1,VLOOKUP(EXTSELECT,MINHEIGHTTABLE,59,FALSE),0)","v":0},{"$f":"IF(EXTR>1,VLOOKUP(EXTSELECT,MINHEIGHTTABLE,60,FALSE),0)","v":0},{"$f":"IF(EXTR>1,VLOOKUP(EXTSELECT,MINHEIGHTTABLE,61,FALSE),0)","v":0},{"$f":"IF(EXTR>1,VLOOKUP(EXTSELECT,MINHEIGHTTABLE,62,FALSE),0)","v":0},{"$f":"IF(EXTR>1,VLOOKUP(EXTSELECT,MINHEIGHTTABLE,63,FALSE),0)","v":0},{"$f":"IF(EXTR>1,VLOOKUP(EXTSELECT,MINHEIGHTTABLE,64,FALSE),0)","v":0},{"$f":"IF(EXTR>1,VLOOKUP(EXTSELECT,MINHEIGHTTABLE,65,FALSE),0)","v":0},{"$f":"IF(EXTR>1,VLOOKUP(EXTSELECT,MINHEIGHTTABLE,66,FALSE),0)","v":0},{"$f":"IF(EXTR>1,VLOOKUP(EXTSELECT,MINHEIGHTTABLE,67,FALSE),0)","v":0},{"$f":"IF(EXTR>1,VLOOKUP(EXTSELECT,MINHEIGHTTABLE,68,FALSE),0)","v":0},{"$f":"IF(EXTR>1,VLOOKUP(EXTSELECT,MINHEIGHTTABLE,69,FALSE),0)","v":0},{"$f":"IF(EXTR>1,VLOOKUP(EXTSELECT,MINHEIGHTTABLE,70,FALSE),0)","v":0},{"$f":"IF(EXTR>1,VLOOKUP(EXTSELECT,MINHEIGHTTABLE,71,FALSE),0)","v":0},{"$f":"IF(EXTR>1,VLOOKUP(EXTSELECT,MINHEIGHTTABLE,72,FALSE),0)","v":0},{"$f":"IF(EXTR>1,VLOOKUP(EXTSELECT,MINHEIGHTTABLE,73,FALSE),0)","v":0},{"$f":"IF(EXTR>1,VLOOKUP(EXTSELECT,MINHEIGHTTABLE,74,FALSE),0)","v":0},{"$f":"IF(EXTR>1,VLOOKUP(EXTSELECT,MINHEIGHTTABLE,75,FALSE),0)","v":0},{"$f":"IF(EXTR>1,VLOOKUP(EXTSELECT,MINHEIGHTTABLE,76,FALSE),0)","v":0},{"$f":"IF(EXTR>1,VLOOKUP(EXTSELECT,MINHEIGHTTABLE,77,FALSE),0)","v":0},{"$f":"IF(EXTR>1,VLOOKUP(EXTSELECT,MINHEIGHTTABLE,78,FALSE),0)","v":0},{"$f":"IF(EXTR>1,VLOOKUP(EXTSELECT,MINHEIGHTTABLE,79,FALSE),0)","v":0},{"$f":"IF(EXTR>1,VLOOKUP(EXTSELECT,MINHEIGHTTABLE,80,FALSE),0)","v":0},{"$f":"IF(EXTR>1,VLOOKUP(EXTSELECT,MINHEIGHTTABLE,81,FALSE),0)","v":0},{"$f":"IF(EXTR>1,VLOOKUP(EXTSELECT,MINHEIGHTTABLE,82,FALSE),0)","v":0}]
[null,"Max. Width","A77A","A77B","A77C","A77D","A77G","A77H","A77J","A77K","A77L","A77N","A77P","A77Q","A77R","A77S","A77U","A77V","A77W","A77Y","A77Z","A78A","A78B","A78C","A78D","A78G","A78H","A78J","A78K","A78L","A78N","A78P","A78Q","A78R","A78S","A78U","A78V","A78W","A78Y","A78Z","A79A","A79B","A79C","A79D","A79G","A79H","A79J","A79K","A79L","A79N","A79P","A79Q","A79R","A79S","A79U","A79V","A79W","A79Y","A79Z","A105","A110","A111","A112","A113","A114","A115","A116","A117","A118","A119","A120","A121","A122","A123","A124","A125","A126","A127","A128","A129","A130","A131","A132"]
[null,"Mezzo",null,null,null,null,null,null,null,null,null,null,null,null,null,null,null,null,null,null,null,null,null,null,null,null,null,null,null,null,null,null,null,null,null,null,null,null,null,null,null,null,null,null,null,null,null,null,null,null,null,null,null,null,null,null,null,null,null,95.5,95.5,72,120,120,120,120,120,120,76,120,76,120,76,120,60,120,120,120,120,120,120,82,120]
[null,"Mezzo w/ NF",null,null,null,null,null,null,null,null,null,null,null,null,null,null,null,null,null,null,null,null,null,null,null,null,null,null,null,null,null,null,null,null,null,null,null,null,null,null,null,null,null,null,null,null,null,null,null,null,null,null,null,null,null,null,null,null,null,95.5,95.5,72,120,120,120,120,120,120,76,120,76,120,76,120,60,120,120,120,120,120,120,82,120]
[null,"Mezzo w/ Stucco",null,null,null,null,null,null,null,null,null,null,null,null,null,null,null,null,null,null,null,null,null,null,null,null,null,null,null,null,null,null,null,null,null,null,null,null,null,null,null,null,null,null,null,null,null,null,null,null,null,null,null,null,null,null,null,null,null,95.5,95.5,72,120,120,120,120,120,120,76,120,76,120,76,120,60,120,120,120,120,120,120,82,120]
[null,"Platinum",null,null,null,null,null,null,null,null,null,null,null,null,null,null,null,null,null,null,null,null,null,null,null,null,null,null,null,null,null,null,null,null,null,null,null,null,null,null,null,null,null,null,null,null,null,null,null,null,null,null,null,null,null,null,null,null,null,95.5,95.5,72,96,96,96,96,96,96,76,96,76,96,76,96,60,96,96,96,96,96,96,82,96]
[null,"Platinum w/ Stucco",null,null,null,null,null,null,null,null,null,null,null,null,null,null,null,null,null,null,null,null,null,null,null,null,null,null,null,null,null,null,null,null,null,null,null,null,null,null,null,null,null,null,null,null,null,null,null,null,null,null,null,null,null,null,null,null,null,95.5,95.5,72,96,96,96,96,96,96,76,96,76,96,76,96,60,96,96,96,96,96,96,82,96]
[null,"70 - Frame w/ 1-3/8\" NFS",84,95.5,84,120,120,120,120,120,120,120,120,120,120,120,120,120,120,120,120]
[null,"70 - Frame w/ 7/8\" NFS",84,95.5,84,120,120,120,120,120,120,120,120,120,120,120,120,120,120,120,120]
[null,"70 - Frame w/ J-Channel",84,95.5,84,120,120,120,120,120,120,120,120,120,120,120,120,120,120,120,120]
[null,"70 - Frame w/ Stucco",84,95.5,84,120,120,120,120,120,120,120,120,120,120,120,120,120,120,120,120]
[null,"80/90 - Frame w/ 1-3/8\" NFS",null,null,null,null,null,null,null,null,null,null,null,null,null,null,null,null,null,null,null,84,95.5,84,120,120,120,120,120,120,120,120,120,120,120,120,120,120,120,120,84,95.5,84,120,120,120,120,120,120,120,120,120,120,120,120,120,120,120,120]
[null,"80/90 - Frame w/ 1\" NFS",null,null,null,null,null,null,null,null,null,null,null,null,null,null,null,null,null,null,null,84,95.5,84,120,120,120,120,120,120,120,120,120,120,120,120,120,120,120,120,84,95.5,84,120,120,120,120,120,120,120,120,120,120,120,120,120,120,120,120]
[null,"80/90 - Frame w/ Stucco",null,null,null,null,null,null,null,null,null,null,null,null,null,null,null,null,null,null,null,84,95.5,84,120,120,120,120,120,120,120,120,120,120,120,120,120,120,120,120,84,95.5,84,120,120,120,120,120,120,120,120,120,120,120,120,120,120,120,120]
[null,null,{"$f":"IF(EXTR>1,VLOOKUP(EXTSELECT,MAXWIDTHTABLE,2,FALSE),0)","v":0},{"$f":"IF(EXTR>1,VLOOKUP(EXTSELECT,MAXWIDTHTABLE,3,FALSE),0)","v":0},{"$f":"IF(EXTR>1,VLOOKUP(EXTSELECT,MAXWIDTHTABLE,4,FALSE),0)","v":0},{"$f":"IF(EXTR>1,VLOOKUP(EXTSELECT,MAXWIDTHTABLE,5,FALSE),0)","v":0},{"$f":"IF(EXTR>1,VLOOKUP(EXTSELECT,MAXWIDTHTABLE,6,FALSE),0)","v":0},{"$f":"IF(EXTR>1,VLOOKUP(EXTSELECT,MAXWIDTHTABLE,7,FALSE),0)","v":0},{"$f":"IF(EXTR>1,VLOOKUP(EXTSELECT,MAXWIDTHTABLE,8,FALSE),0)","v":0},{"$f":"IF(EXTR>1,VLOOKUP(EXTSELECT,MAXWIDTHTABLE,9,FALSE),0)","v":0},{"$f":"IF(EXTR>1,VLOOKUP(EXTSELECT,MAXWIDTHTABLE,10,FALSE),0)","v":0},{"$f":"IF(EXTR>1,VLOOKUP(EXTSELECT,MAXWIDTHTABLE,11,FALSE),0)","v":0},{"$f":"IF(EXTR>1,VLOOKUP(EXTSELECT,MAXWIDTHTABLE,12,FALSE),0)","v":0},{"$f":"IF(EXTR>1,VLOOKUP(EXTSELECT,MAXWIDTHTABLE,13,FALSE),0)","v":0},{"$f":"IF(EXTR>1,VLOOKUP(EXTSELECT,MAXWIDTHTABLE,14,FALSE),0)","v":0},{"$f":"IF(EXTR>1,VLOOKUP(EXTSELECT,MAXWIDTHTABLE,15,FALSE),0)","v":0},{"$f":"IF(EXTR>1,VLOOKUP(EXTSELECT,MAXWIDTHTABLE,16,FALSE),0)","v":0},{"$f":"IF(EXTR>1,VLOOKUP(EXTSELECT,MAXWIDTHTABLE,17,FALSE),0)","v":0},{"$f":"IF(EXTR>1,VLOOKUP(EXTSELECT,MAXWIDTHTABLE,18,FALSE),0)","v":0},{"$f":"IF(EXTR>1,VLOOKUP(EXTSELECT,MAXWIDTHTABLE,19,FALSE),0)","v":0},{"$f":"IF(EXTR>1,VLOOKUP(EXTSELECT,MAXWIDTHTABLE,20,FALSE),0)","v":0},{"$f":"IF(EXTR>1,VLOOKUP(EXTSELECT,MAXWIDTHTABLE,21,FALSE),0)","v":0},{"$f":"IF(EXTR>1,VLOOKUP(EXTSELECT,MAXWIDTHTABLE,22,FALSE),0)","v":0},{"$f":"IF(EXTR>1,VLOOKUP(EXTSELECT,MAXWIDTHTABLE,23,FALSE),0)","v":0},{"$f":"IF(EXTR>1,VLOOKUP(EXTSELECT,MAXWIDTHTABLE,24,FALSE),0)","v":0},{"$f":"IF(EXTR>1,VLOOKUP(EXTSELECT,MAXWIDTHTABLE,25,FALSE),0)","v":0},{"$f":"IF(EXTR>1,VLOOKUP(EXTSELECT,MAXWIDTHTABLE,26,FALSE),0)","v":0},{"$f":"IF(EXTR>1,VLOOKUP(EXTSELECT,MAXWIDTHTABLE,27,FALSE),0)","v":0},{"$f":"IF(EXTR>1,VLOOKUP(EXTSELECT,MAXWIDTHTABLE,28,FALSE),0)","v":0},{"$f":"IF(EXTR>1,VLOOKUP(EXTSELECT,MAXWIDTHTABLE,29,FALSE),0)","v":0},{"$f":"IF(EXTR>1,VLOOKUP(EXTSELECT,MAXWIDTHTABLE,30,FALSE),0)","v":0},{"$f":"IF(EXTR>1,VLOOKUP(EXTSELECT,MAXWIDTHTABLE,31,FALSE),0)","v":0},{"$f":"IF(EXTR>1,VLOOKUP(EXTSELECT,MAXWIDTHTABLE,32,FALSE),0)","v":0},{"$f":"IF(EXTR>1,VLOOKUP(EXTSELECT,MAXWIDTHTABLE,33,FALSE),0)","v":0},{"$f":"IF(EXTR>1,VLOOKUP(EXTSELECT,MAXWIDTHTABLE,34,FALSE),0)","v":0},{"$f":"IF(EXTR>1,VLOOKUP(EXTSELECT,MAXWIDTHTABLE,35,FALSE),0)","v":0},{"$f":"IF(EXTR>1,VLOOKUP(EXTSELECT,MAXWIDTHTABLE,36,FALSE),0)","v":0},{"$f":"IF(EXTR>1,VLOOKUP(EXTSELECT,MAXWIDTHTABLE,37,FALSE),0)","v":0},{"$f":"IF(EXTR>1,VLOOKUP(EXTSELECT,MAXWIDTHTABLE,38,FALSE),0)","v":0},{"$f":"IF(EXTR>1,VLOOKUP(EXTSELECT,MAXWIDTHTABLE,39,FALSE),0)","v":0},{"$f":"IF(EXTR>1,VLOOKUP(EXTSELECT,MAXWIDTHTABLE,40,FALSE),0)","v":0},{"$f":"IF(EXTR>1,VLOOKUP(EXTSELECT,MAXWIDTHTABLE,41,FALSE),0)","v":0},{"$f":"IF(EXTR>1,VLOOKUP(EXTSELECT,MAXWIDTHTABLE,42,FALSE),0)","v":0},{"$f":"IF(EXTR>1,VLOOKUP(EXTSELECT,MAXWIDTHTABLE,43,FALSE),0)","v":0},{"$f":"IF(EXTR>1,VLOOKUP(EXTSELECT,MAXWIDTHTABLE,44,FALSE),0)","v":0},{"$f":"IF(EXTR>1,VLOOKUP(EXTSELECT,MAXWIDTHTABLE,45,FALSE),0)","v":0},{"$f":"IF(EXTR>1,VLOOKUP(EXTSELECT,MAXWIDTHTABLE,46,FALSE),0)","v":0},{"$f":"IF(EXTR>1,VLOOKUP(EXTSELECT,MAXWIDTHTABLE,47,FALSE),0)","v":0},{"$f":"IF(EXTR>1,VLOOKUP(EXTSELECT,MAXWIDTHTABLE,48,FALSE),0)","v":0},{"$f":"IF(EXTR>1,VLOOKUP(EXTSELECT,MAXWIDTHTABLE,49,FALSE),0)","v":0},{"$f":"IF(EXTR>1,VLOOKUP(EXTSELECT,MAXWIDTHTABLE,50,FALSE),0)","v":0},{"$f":"IF(EXTR>1,VLOOKUP(EXTSELECT,MAXWIDTHTABLE,51,FALSE),0)","v":0},{"$f":"IF(EXTR>1,VLOOKUP(EXTSELECT,MAXWIDTHTABLE,52,FALSE),0)","v":0},{"$f":"IF(EXTR>1,VLOOKUP(EXTSELECT,MAXWIDTHTABLE,53,FALSE),0)","v":0},{"$f":"IF(EXTR>1,VLOOKUP(EXTSELECT,MAXWIDTHTABLE,54,FALSE),0)","v":0},{"$f":"IF(EXTR>1,VLOOKUP(EXTSELECT,MAXWIDTHTABLE,55,FALSE),0)","v":0},{"$f":"IF(EXTR>1,VLOOKUP(EXTSELECT,MAXWIDTHTABLE,56,FALSE),0)","v":0},{"$f":"IF(EXTR>1,VLOOKUP(EXTSELECT,MAXWIDTHTABLE,57,FALSE),0)","v":0},{"$f":"IF(EXTR>1,VLOOKUP(EXTSELECT,MAXWIDTHTABLE,58,FALSE),0)","v":0},{"$f":"IF(EXTR>1,VLOOKUP(EXTSELECT,MAXWIDTHTABLE,59,FALSE),0)","v":0},{"$f":"IF(EXTR>1,VLOOKUP(EXTSELECT,MAXWIDTHTABLE,60,FALSE),0)","v":0},{"$f":"IF(EXTR>1,VLOOKUP(EXTSELECT,MAXWIDTHTABLE,61,FALSE),0)","v":0},{"$f":"IF(EXTR>1,VLOOKUP(EXTSELECT,MAXWIDTHTABLE,62,FALSE),0)","v":0},{"$f":"IF(EXTR>1,VLOOKUP(EXTSELECT,MAXWIDTHTABLE,63,FALSE),0)","v":0},{"$f":"IF(EXTR>1,VLOOKUP(EXTSELECT,MAXWIDTHTABLE,64,FALSE),0)","v":0},{"$f":"IF(EXTR>1,VLOOKUP(EXTSELECT,MAXWIDTHTABLE,65,FALSE),0)","v":0},{"$f":"IF(EXTR>1,VLOOKUP(EXTSELECT,MAXWIDTHTABLE,66,FALSE),0)","v":0},{"$f":"IF(EXTR>1,VLOOKUP(EXTSELECT,MAXWIDTHTABLE,67,FALSE),0)","v":0},{"$f":"IF(EXTR>1,VLOOKUP(EXTSELECT,MAXWIDTHTABLE,68,FALSE),0)","v":0},{"$f":"IF(EXTR>1,VLOOKUP(EXTSELECT,MAXWIDTHTABLE,69,FALSE),0)","v":0},{"$f":"IF(EXTR>1,VLOOKUP(EXTSELECT,MAXWIDTHTABLE,70,FALSE),0)","v":0},{"$f":"IF(EXTR>1,VLOOKUP(EXTSELECT,MAXWIDTHTABLE,71,FALSE),0)","v":0},{"$f":"IF(EXTR>1,VLOOKUP(EXTSELECT,MAXWIDTHTABLE,72,FALSE),0)","v":0},{"$f":"IF(EXTR>1,VLOOKUP(EXTSELECT,MAXWIDTHTABLE,73,FALSE),0)","v":0},{"$f":"IF(EXTR>1,VLOOKUP(EXTSELECT,MAXWIDTHTABLE,74,FALSE),0)","v":0},{"$f":"IF(EXTR>1,VLOOKUP(EXTSELECT,MAXWIDTHTABLE,75,FALSE),0)","v":0},{"$f":"IF(EXTR>1,VLOOKUP(EXTSELECT,MAXWIDTHTABLE,76,FALSE),0)","v":0},{"$f":"IF(EXTR>1,VLOOKUP(EXTSELECT,MAXWIDTHTABLE,77,FALSE),0)","v":0},{"$f":"IF(EXTR>1,VLOOKUP(EXTSELECT,MAXWIDTHTABLE,78,FALSE),0)","v":0},{"$f":"IF(EXTR>1,VLOOKUP(EXTSELECT,MAXWIDTHTABLE,79,FALSE),0)","v":0},{"$f":"IF(EXTR>1,VLOOKUP(EXTSELECT,MAXWIDTHTABLE,80,FALSE),0)","v":0},{"$f":"IF(EXTR>1,VLOOKUP(EXTSELECT,MAXWIDTHTABLE,81,FALSE),0)","v":0},{"$f":"IF(EXTR>1,VLOOKUP(EXTSELECT,MAXWIDTHTABLE,82,FALSE),0)","v":0}]
[null,"Max. Height","A77A","A77B","A77C","A77D","A77G","A77H","A77J","A77K","A77L","A77N","A77P","A77Q","A77R","A77S","A77U","A77V","A77W","A77Y","A77Z","A78A","A78B","A78C","A78D","A78G","A78H","A78J","A78K","A78L","A78N","A78P","A78Q","A78R","A78S","A78U","A78V","A78W","A78Y","A78Z","A79A","A79B","A79C","A79D","A79G","A79H","A79J","A79K","A79L","A79N","A79P","A79Q","A79R","A79S","A79U","A79V","A79W","A79Y","A79Z","A105","A110","A111","A112","A113","A114","A115","A116","A117","A118","A119","A120","A121","A122","A123","A124","A125","A126","A127","A128","A129","A130","A131","A132"]
[null,"Mezzo",null,null,null,null,null,null,null,null,null,null,null,null,null,null,null,null,null,null,null,null,null,null,null,null,null,null,null,null,null,null,null,null,null,null,null,null,null,null,null,null,null,null,null,null,null,null,null,null,null,null,null,null,null,null,null,null,null,47.75,108,72,108,59,108,108,108,108,76,108,76,108,76,108,92.9375,108,108,108,108,108,108,71,108]
[null,"Mezzo w/ NF",null,null,null,null,null,null,null,null,null,null,null,null,null,null,null,null,null,null,null,null,null,null,null,null,null,null,null,null,null,null,null,null,null,null,null,null,null,null,null,null,null,null,null,null,null,null,null,null,null,null,null,null,null,null,null,null,null,47.75,108,72,108,59,108,108,108,108,76,108,76,108,76,108,92.9375,108,108,108,108,108,108,71,108]
[null,"Mezzo w/ Stucco",null,null,null,null,null,null,null,null,null,null,null,null,null,null,null,null,null,null,null,null,null,null,null,null,null,null,null,null,null,null,null,null,null,null,null,null,null,null,null,null,null,null,null,null,null,null,null,null,null,null,null,null,null,null,null,null,null,47.75,108,72,108,59,108,108,108,108,76,108,76,108,76,108,92.9375,108,108,108,108,108,108,71,108]
[null,"Platinum",null,null,null,null,null,null,null,null,null,null,null,null,null,null,null,null,null,null,null,null,null,null,null,null,null,null,null,null,null,null,null,null,null,null,null,null,null,null,null,null,null,null,null,null,null,null,null,null,null,null,null,null,null,null,null,null,null,47.75,96,72,96,47.5,96,96,96,96,76,96,76,96,76,96,92.9375,96,96,96,96,96,96,71,96]
[null,"Platinum w/ Stucco",null,null,null,null,null,null,null,null,null,null,null,null,null,null,null,null,null,null,null,null,null,null,null,null,null,null,null,null,null,null,null,null,null,null,null,null,null,null,null,null,null,null,null,null,null,null,null,null,null,null,null,null,null,null,null,null,null,47.75,96,72,96,47.5,96,96,96,96,76,96,76,96,76,96,92.9375,96,96,96,96,96,96,71,96]
[null,"70 - Frame w/ 1-3/8\" NFS",84,47.75,84,108,84,108,108,59.5,108,108,108,108,108,108,108,108,108,108,108]
[null,"70 - Frame w/ 7/8\" NFS",84,47.75,84,108,84,108,108,59.5,108,108,108,108,108,108,108,108,108,108,108]
[null,"70 - Frame w/ J-Channel",84,47.75,84,108,84,108,108,59.5,108,108,108,108,108,108,108,108,108,108,108]
[null,"70 - Frame w/ Stucco",84,47.75,84,108,84,108,108,59.5,108,108,108,108,108,108,108,108,108,108,108]
[null,"80/90 - Frame w/ 1-3/8\" NFS",null,null,null,null,null,null,null,null,null,null,null,null,null,null,null,null,null,null,null,84,47.75,84,108,84,108,108,59.5,108,108,108,108,108,108,108,108,108,108,108,84,47.75,84,108,84,108,108,59.5,108,108,108,108,108,108,108,108,108,108,108]
[null,"80/90 - Frame w/ 1\" NFS",null,null,null,null,null,null,null,null,null,null,null,null,null,null,null,null,null,null,null,84,47.75,84,108,84,108,108,59.5,108,108,108,108,108,108,108,108,108,108,108,84,47.75,84,108,84,108,108,59.5,108,108,108,108,108,108,108,108,108,108,108]
[null,"80/90 - Frame w/ Stucco",null,null,null,null,null,null,null,null,null,null,null,null,null,null,null,null,null,null,null,84,47.75,84,108,84,108,108,59.5,108,108,108,108,108,108,108,108,108,108,108,84,47.75,84,108,84,108,108,59.5,108,108,108,108,108,108,108,108,108,108,108]
[null,null,{"$f":"IF(EXTR>1,VLOOKUP(EXTSELECT,MAXHEIGHTTABLE,2,FALSE),0)","v":0},{"$f":"IF(EXTR>1,VLOOKUP(EXTSELECT,MAXHEIGHTTABLE,3,FALSE),0)","v":0},{"$f":"IF(EXTR>1,VLOOKUP(EXTSELECT,MAXHEIGHTTABLE,4,FALSE),0)","v":0},{"$f":"IF(EXTR>1,VLOOKUP(EXTSELECT,MAXHEIGHTTABLE,5,FALSE),0)","v":0},{"$f":"IF(EXTR>1,VLOOKUP(EXTSELECT,MAXHEIGHTTABLE,6,FALSE),0)","v":0},{"$f":"IF(EXTR>1,VLOOKUP(EXTSELECT,MAXHEIGHTTABLE,7,FALSE),0)","v":0},{"$f":"IF(EXTR>1,VLOOKUP(EXTSELECT,MAXHEIGHTTABLE,8,FALSE),0)","v":0},{"$f":"IF(EXTR>1,VLOOKUP(EXTSELECT,MAXHEIGHTTABLE,9,FALSE),0)","v":0},{"$f":"IF(EXTR>1,VLOOKUP(EXTSELECT,MAXHEIGHTTABLE,10,FALSE),0)","v":0},{"$f":"IF(EXTR>1,VLOOKUP(EXTSELECT,MAXHEIGHTTABLE,11,FALSE),0)","v":0},{"$f":"IF(EXTR>1,VLOOKUP(EXTSELECT,MAXHEIGHTTABLE,12,FALSE),0)","v":0},{"$f":"IF(EXTR>1,VLOOKUP(EXTSELECT,MAXHEIGHTTABLE,13,FALSE),0)","v":0},{"$f":"IF(EXTR>1,VLOOKUP(EXTSELECT,MAXHEIGHTTABLE,14,FALSE),0)","v":0},{"$f":"IF(EXTR>1,VLOOKUP(EXTSELECT,MAXHEIGHTTABLE,15,FALSE),0)","v":0},{"$f":"IF(EXTR>1,VLOOKUP(EXTSELECT,MAXHEIGHTTABLE,16,FALSE),0)","v":0},{"$f":"IF(EXTR>1,VLOOKUP(EXTSELECT,MAXHEIGHTTABLE,17,FALSE),0)","v":0},{"$f":"IF(EXTR>1,VLOOKUP(EXTSELECT,MAXHEIGHTTABLE,18,FALSE),0)","v":0},{"$f":"IF(EXTR>1,VLOOKUP(EXTSELECT,MAXHEIGHTTABLE,19,FALSE),0)","v":0},{"$f":"IF(EXTR>1,VLOOKUP(EXTSELECT,MAXHEIGHTTABLE,20,FALSE),0)","v":0},{"$f":"IF(EXTR>1,VLOOKUP(EXTSELECT,MAXHEIGHTTABLE,21,FALSE),0)","v":0},{"$f":"IF(EXTR>1,VLOOKUP(EXTSELECT,MAXHEIGHTTABLE,22,FALSE),0)","v":0},{"$f":"IF(EXTR>1,VLOOKUP(EXTSELECT,MAXHEIGHTTABLE,23,FALSE),0)","v":0},{"$f":"IF(EXTR>1,VLOOKUP(EXTSELECT,MAXHEIGHTTABLE,24,FALSE),0)","v":0},{"$f":"IF(EXTR>1,VLOOKUP(EXTSELECT,MAXHEIGHTTABLE,25,FALSE),0)","v":0},{"$f":"IF(EXTR>1,VLOOKUP(EXTSELECT,MAXHEIGHTTABLE,26,FALSE),0)","v":0},{"$f":"IF(EXTR>1,VLOOKUP(EXTSELECT,MAXHEIGHTTABLE,27,FALSE),0)","v":0},{"$f":"IF(EXTR>1,VLOOKUP(EXTSELECT,MAXHEIGHTTABLE,28,FALSE),0)","v":0},{"$f":"IF(EXTR>1,VLOOKUP(EXTSELECT,MAXHEIGHTTABLE,29,FALSE),0)","v":0},{"$f":"IF(EXTR>1,VLOOKUP(EXTSELECT,MAXHEIGHTTABLE,30,FALSE),0)","v":0},{"$f":"IF(EXTR>1,VLOOKUP(EXTSELECT,MAXHEIGHTTABLE,31,FALSE),0)","v":0},{"$f":"IF(EXTR>1,VLOOKUP(EXTSELECT,MAXHEIGHTTABLE,32,FALSE),0)","v":0},{"$f":"IF(EXTR>1,VLOOKUP(EXTSELECT,MAXHEIGHTTABLE,33,FALSE),0)","v":0},{"$f":"IF(EXTR>1,VLOOKUP(EXTSELECT,MAXHEIGHTTABLE,34,FALSE),0)","v":0},{"$f":"IF(EXTR>1,VLOOKUP(EXTSELECT,MAXHEIGHTTABLE,35,FALSE),0)","v":0},{"$f":"IF(EXTR>1,VLOOKUP(EXTSELECT,MAXHEIGHTTABLE,36,FALSE),0)","v":0},{"$f":"IF(EXTR>1,VLOOKUP(EXTSELECT,MAXHEIGHTTABLE,37,FALSE),0)","v":0},{"$f":"IF(EXTR>1,VLOOKUP(EXTSELECT,MAXHEIGHTTABLE,38,FALSE),0)","v":0},{"$f":"IF(EXTR>1,VLOOKUP(EXTSELECT,MAXHEIGHTTABLE,39,FALSE),0)","v":0},{"$f":"IF(EXTR>1,VLOOKUP(EXTSELECT,MAXHEIGHTTABLE,40,FALSE),0)","v":0},{"$f":"IF(EXTR>1,VLOOKUP(EXTSELECT,MAXHEIGHTTABLE,41,FALSE),0)","v":0},{"$f":"IF(EXTR>1,VLOOKUP(EXTSELECT,MAXHEIGHTTABLE,42,FALSE),0)","v":0},{"$f":"IF(EXTR>1,VLOOKUP(EXTSELECT,MAXHEIGHTTABLE,43,FALSE),0)","v":0},{"$f":"IF(EXTR>1,VLOOKUP(EXTSELECT,MAXHEIGHTTABLE,44,FALSE),0)","v":0},{"$f":"IF(EXTR>1,VLOOKUP(EXTSELECT,MAXHEIGHTTABLE,45,FALSE),0)","v":0},{"$f":"IF(EXTR>1,VLOOKUP(EXTSELECT,MAXHEIGHTTABLE,46,FALSE),0)","v":0},{"$f":"IF(EXTR>1,VLOOKUP(EXTSELECT,MAXHEIGHTTABLE,47,FALSE),0)","v":0},{"$f":"IF(EXTR>1,VLOOKUP(EXTSELECT,MAXHEIGHTTABLE,48,FALSE),0)","v":0},{"$f":"IF(EXTR>1,VLOOKUP(EXTSELECT,MAXHEIGHTTABLE,49,FALSE),0)","v":0},{"$f":"IF(EXTR>1,VLOOKUP(EXTSELECT,MAXHEIGHTTABLE,50,FALSE),0)","v":0},{"$f":"IF(EXTR>1,VLOOKUP(EXTSELECT,MAXHEIGHTTABLE,51,FALSE),0)","v":0},{"$f":"IF(EXTR>1,VLOOKUP(EXTSELECT,MAXHEIGHTTABLE,52,FALSE),0)","v":0},{"$f":"IF(EXTR>1,VLOOKUP(EXTSELECT,MAXHEIGHTTABLE,53,FALSE),0)","v":0},{"$f":"IF(EXTR>1,VLOOKUP(EXTSELECT,MAXHEIGHTTABLE,54,FALSE),0)","v":0},{"$f":"IF(EXTR>1,VLOOKUP(EXTSELECT,MAXHEIGHTTABLE,55,FALSE),0)","v":0},{"$f":"IF(EXTR>1,VLOOKUP(EXTSELECT,MAXHEIGHTTABLE,56,FALSE),0)","v":0},{"$f":"IF(EXTR>1,VLOOKUP(EXTSELECT,MAXHEIGHTTABLE,57,FALSE),0)","v":0},{"$f":"IF(EXTR>1,VLOOKUP(EXTSELECT,MAXHEIGHTTABLE,58,FALSE),0)","v":0},{"$f":"IF(EXTR>1,VLOOKUP(EXTSELECT,MAXHEIGHTTABLE,59,FALSE),0)","v":0},{"$f":"IF(EXTR>1,VLOOKUP(EXTSELECT,MAXHEIGHTTABLE,60,FALSE),0)","v":0},{"$f":"IF(EXTR>1,VLOOKUP(EXTSELECT,MAXHEIGHTTABLE,61,FALSE),0)","v":0},{"$f":"IF(EXTR>1,VLOOKUP(EXTSELECT,MAXHEIGHTTABLE,62,FALSE),0)","v":0},{"$f":"IF(EXTR>1,VLOOKUP(EXTSELECT,MAXHEIGHTTABLE,63,FALSE),0)","v":0},{"$f":"IF(EXTR>1,VLOOKUP(EXTSELECT,MAXHEIGHTTABLE,64,FALSE),0)","v":0},{"$f":"IF(EXTR>1,VLOOKUP(EXTSELECT,MAXHEIGHTTABLE,65,FALSE),0)","v":0},{"$f":"IF(EXTR>1,VLOOKUP(EXTSELECT,MAXHEIGHTTABLE,66,FALSE),0)","v":0},{"$f":"IF(EXTR>1,VLOOKUP(EXTSELECT,MAXHEIGHTTABLE,67,FALSE),0)","v":0},{"$f":"IF(EXTR>1,VLOOKUP(EXTSELECT,MAXHEIGHTTABLE,68,FALSE),0)","v":0},{"$f":"IF(EXTR>1,VLOOKUP(EXTSELECT,MAXHEIGHTTABLE,69,FALSE),0)","v":0},{"$f":"IF(EXTR>1,VLOOKUP(EXTSELECT,MAXHEIGHTTABLE,70,FALSE),0)","v":0},{"$f":"IF(EXTR>1,VLOOKUP(EXTSELECT,MAXHEIGHTTABLE,71,FALSE),0)","v":0},{"$f":"IF(EXTR>1,VLOOKUP(EXTSELECT,MAXHEIGHTTABLE,72,FALSE),0)","v":0},{"$f":"IF(EXTR>1,VLOOKUP(EXTSELECT,MAXHEIGHTTABLE,73,FALSE),0)","v":0},{"$f":"IF(EXTR>1,VLOOKUP(EXTSELECT,MAXHEIGHTTABLE,74,FALSE),0)","v":0},{"$f":"IF(EXTR>1,VLOOKUP(EXTSELECT,MAXHEIGHTTABLE,75,FALSE),0)","v":0},{"$f":"IF(EXTR>1,VLOOKUP(EXTSELECT,MAXHEIGHTTABLE,76,FALSE),0)","v":0},{"$f":"IF(EXTR>1,VLOOKUP(EXTSELECT,MAXHEIGHTTABLE,77,FALSE),0)","v":0},{"$f":"IF(EXTR>1,VLOOKUP(EXTSELECT,MAXHEIGHTTABLE,78,FALSE),0)","v":0},{"$f":"IF(EXTR>1,VLOOKUP(EXTSELECT,MAXHEIGHTTABLE,79,FALSE),0)","v":0},{"$f":"IF(EXTR>1,VLOOKUP(EXTSELECT,MAXHEIGHTTABLE,80,FALSE),0)","v":0},{"$f":"IF(EXTR>1,VLOOKUP(EXTSELECT,MAXHEIGHTTABLE,81,FALSE),0)","v":0},{"$f":"IF(EXTR>1,VLOOKUP(EXTSELECT,MAXHEIGHTTABLE,82,FALSE),0)","v":0}]
[null,"Max. UI","A77A","A77B","A77C","A77D","A77G","A77H","A77J","A77K","A77L","A77N","A77P","A77Q","A77R","A77S","A77U","A77V","A77W","A77Y","A77Z","A78A","A78B","A78C","A78D","A78G","A78H","A78J","A78K","A78L","A78N","A78P","A78Q","A78R","A78S","A78U","A78V","A78W","A78Y","A78Z","A79A","A79B","A79C","A79D","A79G","A79H","A79J","A79K","A79L","A79N","A79P","A79Q","A79R","A79S","A79U","A79V","A79W","A79Y","A79Z","A105","A110","A111","A112","A113","A114","A115","A116","A117","A118","A119","A120","A121","A122","A123","A124","A125","A126","A127","A128","A129","A130","A131","A132"]
[null,"Mezzo",null,null,null,null,null,null,null,null,null,null,null,null,null,null,null,null,null,null,null,null,null,null,null,null,null,null,null,null,null,null,null,null,null,null,null,null,null,null,null,null,null,null,null,null,null,null,null,null,null,null,null,null,null,null,null,null,null,180,180,180,180,180,180,180,180,180,180,180,180,180,180,180,180,180,180,180,180,180,180,180,180]
[null,"Mezzo w/ NF",null,null,null,null,null,null,null,null,null,null,null,null,null,null,null,null,null,null,null,null,null,null,null,null,null,null,null,null,null,null,null,null,null,null,null,null,null,null,null,null,null,null,null,null,null,null,null,null,null,null,null,null,null,null,null,null,null,180,180,180,180,180,180,180,180,180,180,180,180,180,180,180,180,180,180,180,180,180,180,180,180]
[null,"Mezzo w/ Stucco",null,null,null,null,null,null,null,null,null,null,null,null,null,null,null,null,null,null,null,null,null,null,null,null,null,null,null,null,null,null,null,null,null,null,null,null,null,null,null,null,null,null,null,null,null,null,null,null,null,null,null,null,null,null,null,null,null,180,180,180,180,180,180,180,180,180,180,180,180,180,180,180,180,180,180,180,180,180,180,180,180]
[null,"Platinum",null,null,null,null,null,null,null,null,null,null,null,null,null,null,null,null,null,null,null,null,null,null,null,null,null,null,null,null,null,null,null,null,null,null,null,null,null,null,null,null,null,null,null,null,null,null,null,null,null,null,null,null,null,null,null,null,null,180,180,180,180,180,180,180,180,180,180,180,180,180,180,180,180,180,180,180,180,180,180,180,180]
[null,"Platinum w/ Stucco",null,null,null,null,null,null,null,null,null,null,null,null,null,null,null,null,null,null,null,null,null,null,null,null,null,null,null,null,null,null,null,null,null,null,null,null,null,null,null,null,null,null,null,null,null,null,null,null,null,null,null,null,null,null,null,null,null,180,180,180,180,180,180,180,180,180,180,180,180,180,180,180,180,180,180,180,180,180,180,180,180]
[null,"70 - Frame w/ 1-3/8\" NFS",180,180,180,180,180,180,180,180,180,180,180,180,180,180,180,180,180,180,180]
[null,"70 - Frame w/ 7/8\" NFS",180,180,180,180,180,180,180,180,180,180,180,180,180,180,180,180,180,180,180]
[null,"70 - Frame w/ J-Channel",180,180,180,180,180,180,180,180,180,180,180,180,180,180,180,180,180,180,180]
[null,"70 - Frame w/ Stucco",180,180,180,180,180,180,180,180,180,180,180,180,180,180,180,180,180,180,180]
[null,"80/90 - Frame w/ 1-3/8\" NFS",null,null,null,null,null,null,null,null,null,null,null,null,null,null,null,null,null,null,null,180,180,180,180,180,180,180,180,180,180,180,180,180,180,180,180,180,180,180,180,180,180,180,180,180,180,180,180,180,180,180,180,180,180,180,180,180,180]
[null,"80/90 - Frame w/ 1\" NFS",null,null,null,null,null,null,null,null,null,null,null,null,null,null,null,null,null,null,null,180,180,180,180,180,180,180,180,180,180,180,180,180,180,180,180,180,180,180,180,180,180,180,180,180,180,180,180,180,180,180,180,180,180,180,180,180,180]
[null,"80/90 - Frame w/ Stucco",null,null,null,null,null,null,null,null,null,null,null,null,null,null,null,null,null,null,null,180,180,180,180,180,180,180,180,180,180,180,180,180,180,180,180,180,180,180,180,180,180,180,180,180,180,180,180,180,180,180,180,180,180,180,180,180,180]
[null,null,{"$f":"IF(EXTR>1,VLOOKUP(EXTSELECT,MAXUITABLE,2,FALSE),0)","v":0},{"$f":"IF(EXTR>1,VLOOKUP(EXTSELECT,MAXUITABLE,3,FALSE),0)","v":0},{"$f":"IF(EXTR>1,VLOOKUP(EXTSELECT,MAXUITABLE,4,FALSE),0)","v":0},{"$f":"IF(EXTR>1,VLOOKUP(EXTSELECT,MAXUITABLE,5,FALSE),0)","v":0},{"$f":"IF(EXTR>1,VLOOKUP(EXTSELECT,MAXUITABLE,6,FALSE),0)","v":0},{"$f":"IF(EXTR>1,VLOOKUP(EXTSELECT,MAXUITABLE,7,FALSE),0)","v":0},{"$f":"IF(EXTR>1,VLOOKUP(EXTSELECT,MAXUITABLE,8,FALSE),0)","v":0},{"$f":"IF(EXTR>1,VLOOKUP(EXTSELECT,MAXUITABLE,9,FALSE),0)","v":0},{"$f":"IF(EXTR>1,VLOOKUP(EXTSELECT,MAXUITABLE,10,FALSE),0)","v":0},{"$f":"IF(EXTR>1,VLOOKUP(EXTSELECT,MAXUITABLE,11,FALSE),0)","v":0},{"$f":"IF(EXTR>1,VLOOKUP(EXTSELECT,MAXUITABLE,12,FALSE),0)","v":0},{"$f":"IF(EXTR>1,VLOOKUP(EXTSELECT,MAXUITABLE,13,FALSE),0)","v":0},{"$f":"IF(EXTR>1,VLOOKUP(EXTSELECT,MAXUITABLE,14,FALSE),0)","v":0},{"$f":"IF(EXTR>1,VLOOKUP(EXTSELECT,MAXUITABLE,15,FALSE),0)","v":0},{"$f":"IF(EXTR>1,VLOOKUP(EXTSELECT,MAXUITABLE,16,FALSE),0)","v":0},{"$f":"IF(EXTR>1,VLOOKUP(EXTSELECT,MAXUITABLE,17,FALSE),0)","v":0},{"$f":"IF(EXTR>1,VLOOKUP(EXTSELECT,MAXUITABLE,18,FALSE),0)","v":0},{"$f":"IF(EXTR>1,VLOOKUP(EXTSELECT,MAXUITABLE,19,FALSE),0)","v":0},{"$f":"IF(EXTR>1,VLOOKUP(EXTSELECT,MAXUITABLE,20,FALSE),0)","v":0},{"$f":"IF(EXTR>1,VLOOKUP(EXTSELECT,MAXUITABLE,21,FALSE),0)","v":0},{"$f":"IF(EXTR>1,VLOOKUP(EXTSELECT,MAXUITABLE,22,FALSE),0)","v":0},{"$f":"IF(EXTR>1,VLOOKUP(EXTSELECT,MAXUITABLE,23,FALSE),0)","v":0},{"$f":"IF(EXTR>1,VLOOKUP(EXTSELECT,MAXUITABLE,24,FALSE),0)","v":0},{"$f":"IF(EXTR>1,VLOOKUP(EXTSELECT,MAXUITABLE,25,FALSE),0)","v":0},{"$f":"IF(EXTR>1,VLOOKUP(EXTSELECT,MAXUITABLE,26,FALSE),0)","v":0},{"$f":"IF(EXTR>1,VLOOKUP(EXTSELECT,MAXUITABLE,27,FALSE),0)","v":0},{"$f":"IF(EXTR>1,VLOOKUP(EXTSELECT,MAXUITABLE,28,FALSE),0)","v":0},{"$f":"IF(EXTR>1,VLOOKUP(EXTSELECT,MAXUITABLE,29,FALSE),0)","v":0},{"$f":"IF(EXTR>1,VLOOKUP(EXTSELECT,MAXUITABLE,30,FALSE),0)","v":0},{"$f":"IF(EXTR>1,VLOOKUP(EXTSELECT,MAXUITABLE,31,FALSE),0)","v":0},{"$f":"IF(EXTR>1,VLOOKUP(EXTSELECT,MAXUITABLE,32,FALSE),0)","v":0},{"$f":"IF(EXTR>1,VLOOKUP(EXTSELECT,MAXUITABLE,33,FALSE),0)","v":0},{"$f":"IF(EXTR>1,VLOOKUP(EXTSELECT,MAXUITABLE,34,FALSE),0)","v":0},{"$f":"IF(EXTR>1,VLOOKUP(EXTSELECT,MAXUITABLE,35,FALSE),0)","v":0},{"$f":"IF(EXTR>1,VLOOKUP(EXTSELECT,MAXUITABLE,36,FALSE),0)","v":0},{"$f":"IF(EXTR>1,VLOOKUP(EXTSELECT,MAXUITABLE,37,FALSE),0)","v":0},{"$f":"IF(EXTR>1,VLOOKUP(EXTSELECT,MAXUITABLE,38,FALSE),0)","v":0},{"$f":"IF(EXTR>1,VLOOKUP(EXTSELECT,MAXUITABLE,39,FALSE),0)","v":0},{"$f":"IF(EXTR>1,VLOOKUP(EXTSELECT,MAXUITABLE,40,FALSE),0)","v":0},{"$f":"IF(EXTR>1,VLOOKUP(EXTSELECT,MAXUITABLE,41,FALSE),0)","v":0},{"$f":"IF(EXTR>1,VLOOKUP(EXTSELECT,MAXUITABLE,42,FALSE),0)","v":0},{"$f":"IF(EXTR>1,VLOOKUP(EXTSELECT,MAXUITABLE,43,FALSE),0)","v":0},{"$f":"IF(EXTR>1,VLOOKUP(EXTSELECT,MAXUITABLE,44,FALSE),0)","v":0},{"$f":"IF(EXTR>1,VLOOKUP(EXTSELECT,MAXUITABLE,45,FALSE),0)","v":0},{"$f":"IF(EXTR>1,VLOOKUP(EXTSELECT,MAXUITABLE,46,FALSE),0)","v":0},{"$f":"IF(EXTR>1,VLOOKUP(EXTSELECT,MAXUITABLE,47,FALSE),0)","v":0},{"$f":"IF(EXTR>1,VLOOKUP(EXTSELECT,MAXUITABLE,48,FALSE),0)","v":0},{"$f":"IF(EXTR>1,VLOOKUP(EXTSELECT,MAXUITABLE,49,FALSE),0)","v":0},{"$f":"IF(EXTR>1,VLOOKUP(EXTSELECT,MAXUITABLE,50,FALSE),0)","v":0},{"$f":"IF(EXTR>1,VLOOKUP(EXTSELECT,MAXUITABLE,51,FALSE),0)","v":0},{"$f":"IF(EXTR>1,VLOOKUP(EXTSELECT,MAXUITABLE,52,FALSE),0)","v":0},{"$f":"IF(EXTR>1,VLOOKUP(EXTSELECT,MAXUITABLE,53,FALSE),0)","v":0},{"$f":"IF(EXTR>1,VLOOKUP(EXTSELECT,MAXUITABLE,54,FALSE),0)","v":0},{"$f":"IF(EXTR>1,VLOOKUP(EXTSELECT,MAXUITABLE,55,FALSE),0)","v":0},{"$f":"IF(EXTR>1,VLOOKUP(EXTSELECT,MAXUITABLE,56,FALSE),0)","v":0},{"$f":"IF(EXTR>1,VLOOKUP(EXTSELECT,MAXUITABLE,57,FALSE),0)","v":0},{"$f":"IF(EXTR>1,VLOOKUP(EXTSELECT,MAXUITABLE,58,FALSE),0)","v":0},{"$f":"IF(EXTR>1,VLOOKUP(EXTSELECT,MAXUITABLE,59,FALSE),0)","v":0},{"$f":"IF(EXTR>1,VLOOKUP(EXTSELECT,MAXUITABLE,60,FALSE),0)","v":0},{"$f":"IF(EXTR>1,VLOOKUP(EXTSELECT,MAXUITABLE,61,FALSE),0)","v":0},{"$f":"IF(EXTR>1,VLOOKUP(EXTSELECT,MAXUITABLE,62,FALSE),0)","v":0},{"$f":"IF(EXTR>1,VLOOKUP(EXTSELECT,MAXUITABLE,63,FALSE),0)","v":0},{"$f":"IF(EXTR>1,VLOOKUP(EXTSELECT,MAXUITABLE,64,FALSE),0)","v":0},{"$f":"IF(EXTR>1,VLOOKUP(EXTSELECT,MAXUITABLE,65,FALSE),0)","v":0},{"$f":"IF(EXTR>1,VLOOKUP(EXTSELECT,MAXUITABLE,66,FALSE),0)","v":0},{"$f":"IF(EXTR>1,VLOOKUP(EXTSELECT,MAXUITABLE,67,FALSE),0)","v":0},{"$f":"IF(EXTR>1,VLOOKUP(EXTSELECT,MAXUITABLE,68,FALSE),0)","v":0},{"$f":"IF(EXTR>1,VLOOKUP(EXTSELECT,MAXUITABLE,69,FALSE),0)","v":0},{"$f":"IF(EXTR>1,VLOOKUP(EXTSELECT,MAXUITABLE,70,FALSE),0)","v":0},{"$f":"IF(EXTR>1,VLOOKUP(EXTSELECT,MAXUITABLE,71,FALSE),0)","v":0},{"$f":"IF(EXTR>1,VLOOKUP(EXTSELECT,MAXUITABLE,72,FALSE),0)","v":0},{"$f":"IF(EXTR>1,VLOOKUP(EXTSELECT,MAXUITABLE,73,FALSE),0)","v":0},{"$f":"IF(EXTR>1,VLOOKUP(EXTSELECT,MAXUITABLE,74,FALSE),0)","v":0},{"$f":"IF(EXTR>1,VLOOKUP(EXTSELECT,MAXUITABLE,75,FALSE),0)","v":0},{"$f":"IF(EXTR>1,VLOOKUP(EXTSELECT,MAXUITABLE,76,FALSE),0)","v":0},{"$f":"IF(EXTR>1,VLOOKUP(EXTSELECT,MAXUITABLE,77,FALSE),0)","v":0},{"$f":"IF(EXTR>1,VLOOKUP(EXTSELECT,MAXUITABLE,78,FALSE),0)","v":0},{"$f":"IF(EXTR>1,VLOOKUP(EXTSELECT,MAXUITABLE,79,FALSE),0)","v":0},{"$f":"IF(EXTR>1,VLOOKUP(EXTSELECT,MAXUITABLE,80,FALSE),0)","v":0},{"$f":"IF(EXTR>1,VLOOKUP(EXTSELECT,MAXUITABLE,81,FALSE),0)","v":0},{"$f":"IF(EXTR>1,VLOOKUP(EXTSELECT,MAXUITABLE,82,FALSE),0)","v":0}]
[]
[null,null,"Model","Min. W","Min. H","Max. W","Max. H","Max. UI","Glass_W","Glass_H"]
[null,null,"A77A",{"$f":"$C$15","v":0},{"$f":"$C$29","v":0},{"$f":"$C$43","v":0},{"$f":"$C$57","v":0},{"$f":"$C$71","v":0},{"$f":"'Shape Limits'!$I$82","v":0},{"$f":"'Shape Limits'!$I$81","v":0}]
[null,null,"A77B",{"$f":"$D$15","v":0},{"$f":"$D$29","v":0},{"$f":"$D$43","v":0},{"$f":"$D$57","v":0},{"$f":"$D$71","v":0},{"$f":"'Shape Limits'!$I$5","v":0},{"$f":"'Shape Limits'!$I$4","v":0}]
[null,null,"A77C",{"$f":"$E$15","v":0},{"$f":"$E$29","v":0},{"$f":"$E$43","v":0},{"$f":"$E$57","v":0},{"$f":"$E$71","v":0},{"$f":"'Shape Limits'!$I$22","v":0},{"$f":"'Shape Limits'!$I$22","v":0}]
[null,null,"A77D",{"$f":"$F$15","v":0},{"$f":"$F$29","v":0},{"$f":"$F$43","v":0},{"$f":"$F$57","v":0},{"$f":"$F$71","v":0},{"$f":"'Shape Limits'!$U$106","v":0},{"$f":"'Shape Limits'!$U$107","v":0}]
[null,null,"A77G",{"$f":"$G$15","v":0},{"$f":"$G$29","v":0},{"$f":"$G$43","v":0},{"$f":"$G$57","v":0},{"$f":"$G$71","v":0},{"$f":"'Shape Limits'!$I$124","v":0},{"$f":"'Shape Limits'!$I$125","v":0}]
[null,null,"A77H",{"$f":"$H$15","v":0},{"$f":"$H$29","v":0},{"$f":"$H$43","v":0},{"$f":"$H$57","v":0},{"$f":"$H$71","v":0},{"$f":"'Shape Limits'!$K$105","v":0},{"$f":"'Shape Limits'!$K$106","v":0}]
[null,null,"A77J",{"$f":"$I$15","v":0},{"$f":"$I$29","v":0},{"$f":"$I$43","v":0},{"$f":"$I$57","v":0},{"$f":"$I$71","v":0},{"$f":"'Shape Limits'!$K$116","v":0},{"$f":"'Shape Limits'!$K$117","v":0}]
[null,null,"A77K",{"$f":"$J$15","v":0},{"$f":"$J$29","v":0},{"$f":"$J$43","v":0},{"$f":"$J$57","v":0},{"$f":"$J$71","v":0},{"$f":"'Shape Limits'!$J$41","v":0},{"$f":"'Shape Limits'!$J$40","v":0}]
[null,null,"A77L",{"$f":"$K$15","v":0},{"$f":"$K$29","v":0},{"$f":"$K$43","v":0},{"$f":"$K$57","v":0},{"$f":"$K$71","v":0},{"$f":"'Shape Limits'!$K$59","v":0},{"$f":"'Shape Limits'!$K$58","v":0}]
[null,null,"A77N",{"$f":"$L$15","v":0},{"$f":"$L$29","v":0},{"$f":"$L$43","v":0},{"$f":"$L$57","v":0},{"$f":"$L$71","v":0},{"$f":"'Shape Limits'!$K$193","v":0},{"$f":"'Shape Limits'!$K$194","v":0}]
[null,null,"A77P",{"$f":"$M$15","v":0},{"$f":"$M$29","v":0},{"$f":"$M$43","v":0},{"$f":"$M$57","v":0},{"$f":"$M$71","v":0},{"$f":"'Shape Limits'!$J$182","v":0},{"$f":"'Shape Limits'!$J$183","v":0}]
[null,null,"A77Q",{"$f":"$N$15","v":0},{"$f":"$N$29","v":0},{"$f":"$N$43","v":0},{"$f":"$N$57","v":0},{"$f":"$N$71","v":0},{"$f":"'Shape Limits'!$J$172","v":0},{"$f":"'Shape Limits'!$J$173","v":0}]
[null,null,"A77R",{"$f":"$O$15","v":0},{"$f":"$O$29","v":0},{"$f":"$O$43","v":0},{"$f":"$O$57","v":0},{"$f":"$O$71","v":0},{"$f":"'Shape Limits'!$J$10","v":0},{"$f":"'Shape Limits'!$J$11","v":0}]
[null,null,"A77S",{"$f":"$P$15","v":0},{"$f":"$P$29","v":0},{"$f":"$P$43","v":0},{"$f":"$P$57","v":0},{"$f":"$P$71","v":0},{"$f":"'Shape Limits'!$J$162","v":0},{"$f":"'Shape Limits'!$J$159","v":0}]
[null,null,"A77U",{"$f":"$Q$15","v":0},{"$f":"$Q$29","v":0},{"$f":"$Q$43","v":0},{"$f":"$Q$57","v":0},{"$f":"$Q$71","v":0},{"$f":"'Shape Limits'!$J$31","v":0},{"$f":"'Shape Limits'!$J$32","v":0}]
[null,null,"A77V",{"$f":"$R$15","v":0},{"$f":"$R$29","v":0},{"$f":"$R$43","v":0},{"$f":"$R$57","v":0},{"$f":"$R$71","v":0},{"$f":"'Shape Limits'!$J$49","v":0},{"$f":"'Shape Limits'!$J$48","v":0}]
[null,null,"A77W",{"$f":"$S$15","v":0},{"$f":"$S$29","v":0},{"$f":"$S$43","v":0},{"$f":"$S$57","v":0},{"$f":"$S$71","v":0},{"$f":"'Shape Limits'!$J$71","v":0},{"$f":"'Shape Limits'!$J$70","v":0}]
[null,null,"A77Y",{"$f":"$T$15","v":0},{"$f":"$T$29","v":0},{"$f":"$T$43","v":0},{"$f":"$T$57","v":0},{"$f":"$T$71","v":0},{"$f":"'Shape Limits'!$J$139","v":0},{"$f":"'Shape Limits'!$J$140","v":0}]
[null,null,"A77Z",{"$f":"$U$15","v":0},{"$f":"$U$29","v":0},{"$f":"$U$43","v":0},{"$f":"$U$57","v":0},{"$f":"$U$71","v":0},{"$f":"'Shape Limits'!$J$151","v":0},{"$f":"'Shape Limits'!$J$152","v":0}]
[null,null,"A78A",{"$f":"$V$15","v":0},{"$f":"$V$29","v":0},{"$f":"$V$43","v":0},{"$f":"$V$57","v":0},{"$f":"$V$71","v":0},{"$f":"'Shape Limits'!$I$82","v":0},{"$f":"'Shape Limits'!$I$81","v":0}]
[null,null,"A78B",{"$f":"$W$15","v":0},{"$f":"$W$29","v":0},{"$f":"$W$43","v":0},{"$f":"$W$57","v":0},{"$f":"$W$71","v":0},{"$f":"'Shape Limits'!$I$5","v":0},{"$f":"'Shape Limits'!$I$4","v":0}]
[null,null,"A78C",{"$f":"$X$15","v":0},{"$f":"$X$29","v":0},{"$f":"$X$43","v":0},{"$f":"$X$57","v":0},{"$f":"$X$71","v":0},{"$f":"'Shape Limits'!$I$22","v":0},{"$f":"'Shape Limits'!$I$22","v":0}]
[null,null,"A78D",{"$f":"$Y$15","v":0},{"$f":"$Y$29","v":0},{"$f":"$Y$43","v":0},{"$f":"$Y$57","v":0},{"$f":"$Y$71","v":0},{"$f":"'Shape Limits'!$U$106","v":0},{"$f":"'Shape Limits'!$U$107","v":0}]
[null,null,"A78G",{"$f":"$Z$15","v":0},{"$f":"$Z$29","v":0},{"$f":"$Z$43","v":0},{"$f":"$Z$57","v":0},{"$f":"$Z$71","v":0},{"$f":"'Shape Limits'!$I$124","v":0},{"$f":"'Shape Limits'!$I$125","v":0}]
[null,null,"A78H",{"$f":"$AA$15","v":0},{"$f":"$AA$29","v":0},{"$f":"$AA$43","v":0},{"$f":"$AA$57","v":0},{"$f":"$AA$71","v":0},{"$f":"'Shape Limits'!$K$105","v":0},{"$f":"'Shape Limits'!$K$106","v":0}]
[null,null,"A78J",{"$f":"$AB$15","v":0},{"$f":"$AB$29","v":0},{"$f":"$AB$43","v":0},{"$f":"$AB$57","v":0},{"$f":"$AB$71","v":0},{"$f":"'Shape Limits'!$K$116","v":0},{"$f":"'Shape Limits'!$K$117","v":0}]
[null,null,"A78K",{"$f":"$AC$15","v":0},{"$f":"$AC$29","v":0},{"$f":"$AC$43","v":0},{"$f":"$AC$57","v":0},{"$f":"$AC$71","v":0},{"$f":"'Shape Limits'!$J$41","v":0},{"$f":"'Shape Limits'!$J$40","v":0}]
[null,null,"A78L",{"$f":"$AD$15","v":0},{"$f":"$AD$29","v":0},{"$f":"$AD$43","v":0},{"$f":"$AD$57","v":0},{"$f":"$AD$71","v":0},{"$f":"'Shape Limits'!$K$59","v":0},{"$f":"'Shape Limits'!$K$58","v":0}]
[null,null,"A78N",{"$f":"$AE$15","v":0},{"$f":"$AE$29","v":0},{"$f":"$AE$43","v":0},{"$f":"$AE$57","v":0},{"$f":"$AE$71","v":0},{"$f":"'Shape Limits'!$K$193","v":0},{"$f":"'Shape Limits'!$K$194","v":0}]
[null,null,"A78P",{"$f":"$AF$15","v":0},{"$f":"$AF$29","v":0},{"$f":"$AF$43","v":0},{"$f":"$AF$57","v":0},{"$f":"$AF$71","v":0},{"$f":"'Shape Limits'!$J$182","v":0},{"$f":"'Shape Limits'!$J$183","v":0}]
[null,null,"A78Q",{"$f":"$AG$15","v":0},{"$f":"$AG$29","v":0},{"$f":"$AG$43","v":0},{"$f":"$AG$57","v":0},{"$f":"$AG$71","v":0},{"$f":"'Shape Limits'!$J$172","v":0},{"$f":"'Shape Limits'!$J$173","v":0}]
[null,null,"A78R",{"$f":"$AH$15","v":0},{"$f":"$AH$29","v":0},{"$f":"$AH$43","v":0},{"$f":"$AH$57","v":0},{"$f":"$AH$71","v":0},{"$f":"'Shape Limits'!$J$10","v":0},{"$f":"'Shape Limits'!$J$11","v":0}]
[null,null,"A78S",{"$f":"$AI$15","v":0},{"$f":"$AI$29","v":0},{"$f":"$AI$43","v":0},{"$f":"$AI$57","v":0},{"$f":"$AI$71","v":0},{"$f":"'Shape Limits'!$J$162","v":0},{"$f":"'Shape Limits'!$J$159","v":0}]
[null,null,"A78U",{"$f":"$AJ$15","v":0},{"$f":"$AJ$29","v":0},{"$f":"$AJ$43","v":0},{"$f":"$AJ$57","v":0},{"$f":"$AJ$71","v":0},{"$f":"'Shape Limits'!$J$31","v":0},{"$f":"'Shape Limits'!$J$32","v":0}]
[null,null,"A78V",{"$f":"$AK$15","v":0},{"$f":"$AK$29","v":0},{"$f":"$AK$43","v":0},{"$f":"$AK$57","v":0},{"$f":"$AK$71","v":0},{"$f":"'Shape Limits'!$J$49","v":0},{"$f":"'Shape Limits'!$J$48","v":0}]
[null,null,"A78W",{"$f":"$AL$15","v":0},{"$f":"$AL$29","v":0},{"$f":"$AL$43","v":0},{"$f":"$AL$57","v":0},{"$f":"$AL$71","v":0},{"$f":"'Shape Limits'!$J$71","v":0},{"$f":"'Shape Limits'!$J$70","v":0}]
[null,null,"A78Y",{"$f":"$AM$15","v":0},{"$f":"$AM$29","v":0},{"$f":"$AM$43","v":0},{"$f":"$AM$57","v":0},{"$f":"$AM$71","v":0},{"$f":"'Shape Limits'!$J$139","v":0},{"$f":"'Shape Limits'!$J$140","v":0}]
[null,null,"A78Z",{"$f":"$AN$15","v":0},{"$f":"$AN$29","v":0},{"$f":"$AN$43","v":0},{"$f":"$AN$57","v":0},{"$f":"$AN$71","v":0},{"$f":"'Shape Limits'!$J$151","v":0},{"$f":"'Shape Limits'!$J$152","v":0}]
[null,null,"A79A",{"$f":"$AO$15","v":0},{"$f":"$AO$29","v":0},{"$f":"$AO$43","v":0},{"$f":"$AO$57","v":0},{"$f":"$AO$71","v":0},{"$f":"'Shape Limits'!$I$82","v":0},{"$f":"'Shape Limits'!$I$81","v":0}]
[null,null,"A79B",{"$f":"$AP$15","v":0},{"$f":"$AP$29","v":0},{"$f":"$AP$43","v":0},{"$f":"$AP$57","v":0},{"$f":"$AP$71","v":0},{"$f":"'Shape Limits'!$I$5","v":0},{"$f":"'Shape Limits'!$I$4","v":0}]
[null,null,"A79C",{"$f":"$AQ$15","v":0},{"$f":"$AQ$29","v":0},{"$f":"$AQ$43","v":0},{"$f":"$AQ$57","v":0},{"$f":"$AQ$71","v":0},{"$f":"'Shape Limits'!$I$22","v":0},{"$f":"'Shape Limits'!$I$22","v":0}]
[null,null,"A79D",{"$f":"$AR$15","v":0},{"$f":"$AR$29","v":0},{"$f":"$AR$43","v":0},{"$f":"$AR$57","v":0},{"$f":"$AR$71","v":0},{"$f":"'Shape Limits'!$U$106","v":0},{"$f":"'Shape Limits'!$U$107","v":0}]
[null,null,"A79G",{"$f":"$AS$15","v":0},{"$f":"$AS$29","v":0},{"$f":"$AS$43","v":0},{"$f":"$AS$57","v":0},{"$f":"$AS$71","v":0},{"$f":"'Shape Limits'!$I$124","v":0},{"$f":"'Shape Limits'!$I$125","v":0}]
[null,null,"A79H",{"$f":"$AT$15","v":0},{"$f":"$AT$29","v":0},{"$f":"$AT$43","v":0},{"$f":"$AT$57","v":0},{"$f":"$AT$71","v":0},{"$f":"'Shape Limits'!$K$105","v":0},{"$f":"'Shape Limits'!$K$106","v":0}]
[null,null,"A79J",{"$f":"$AU$15","v":0},{"$f":"$AU$29","v":0},{"$f":"$AU$43","v":0},{"$f":"$AU$57","v":0},{"$f":"$AU$71","v":0},{"$f":"'Shape Limits'!$K$116","v":0},{"$f":"'Shape Limits'!$K$117","v":0}]
[null,null,"A79K",{"$f":"$AV$15","v":0},{"$f":"$AV$29","v":0},{"$f":"$AV$43","v":0},{"$f":"$AV$57","v":0},{"$f":"$AV$71","v":0},{"$f":"'Shape Limits'!$J$41","v":0},{"$f":"'Shape Limits'!$J$40","v":0}]
[null,null,"A79L",{"$f":"$AW$15","v":0},{"$f":"$AW$29","v":0},{"$f":"$AW$43","v":0},{"$f":"$AW$57","v":0},{"$f":"$AW$71","v":0},{"$f":"'Shape Limits'!$K$59","v":0},{"$f":"'Shape Limits'!$K$58","v":0}]
[null,null,"A79N",{"$f":"$AX$15","v":0},{"$f":"$AX$29","v":0},{"$f":"$AX$43","v":0},{"$f":"$AX$57","v":0},{"$f":"$AX$71","v":0},{"$f":"'Shape Limits'!$K$193","v":0},{"$f":"'Shape Limits'!$K$194","v":0}]
[null,null,"A79P",{"$f":"$AY$15","v":0},{"$f":"$AY$29","v":0},{"$f":"$AY$43","v":0},{"$f":"$AY$57","v":0},{"$f":"$AY$71","v":0},{"$f":"'Shape Limits'!$J$182","v":0},{"$f":"'Shape Limits'!$J$183","v":0}]
[null,null,"A79Q",{"$f":"$AZ$15","v":0},{"$f":"$AZ$29","v":0},{"$f":"$AZ$43","v":0},{"$f":"$AZ$57","v":0},{"$f":"$AZ$71","v":0},{"$f":"'Shape Limits'!$J$172","v":0},{"$f":"'Shape Limits'!$J$173","v":0}]
[null,null,"A79R",{"$f":"$BA$15","v":0},{"$f":"$BA$29","v":0},{"$f":"$BA$43","v":0},{"$f":"$BA$57","v":0},{"$f":"$BA$71","v":0},{"$f":"'Shape Limits'!$J$10","v":0},{"$f":"'Shape Limits'!$J$11","v":0}]
[null,null,"A79S",{"$f":"$BB$15","v":0},{"$f":"$BB$29","v":0},{"$f":"$BB$43","v":0},{"$f":"$BB$57","v":0},{"$f":"$BB$71","v":0},{"$f":"'Shape Limits'!$J$162","v":0},{"$f":"'Shape Limits'!$J$159","v":0}]
[null,null,"A79U",{"$f":"$BC$15","v":0},{"$f":"$BC$29","v":0},{"$f":"$BC$43","v":0},{"$f":"$BC$57","v":0},{"$f":"$BC$71","v":0},{"$f":"'Shape Limits'!$J$31","v":0},{"$f":"'Shape Limits'!$J$32","v":0}]
[null,null,"A79V",{"$f":"$BD$15","v":0},{"$f":"$BD$29","v":0},{"$f":"$BD$43","v":0},{"$f":"$BD$57","v":0},{"$f":"$BD$71","v":0},{"$f":"'Shape Limits'!$J$49","v":0},{"$f":"'Shape Limits'!$J$48","v":0}]
[null,null,"A79W",{"$f":"$BE$15","v":0},{"$f":"$BE$29","v":0},{"$f":"$BE$43","v":0},{"$f":"$BE$57","v":0},{"$f":"$BE$71","v":0},{"$f":"'Shape Limits'!$J$71","v":0},{"$f":"'Shape Limits'!$J$70","v":0}]
[null,null,"A79Y",{"$f":"$BF$15","v":0},{"$f":"$BF$29","v":0},{"$f":"$BF$43","v":0},{"$f":"$BF$57","v":0},{"$f":"$BF$71","v":0},{"$f":"'Shape Limits'!$J$139","v":0},{"$f":"'Shape Limits'!$J$140","v":0}]
[null,null,"A79Z",{"$f":"$BG$15","v":0},{"$f":"$BG$29","v":0},{"$f":"$BG$43","v":0},{"$f":"$BG$57","v":0},{"$f":"$BG$71","v":0},{"$f":"'Shape Limits'!$J$151","v":0},{"$f":"'Shape Limits'!$J$152","v":0}]
[null,"B","A105",{"$f":"$BH$15","v":0},{"$f":"$BH$29","v":0},{"$f":"$BH$43","v":0},{"$f":"$BH$57","v":0},{"$f":"$BH$71","v":0},{"$f":"'Shape Limits'!$I$5","v":0},{"$f":"'Shape Limits'!$I$4","v":0}]
[null,"R","A110",{"$f":"$BI$15","v":0},{"$f":"$BI$29","v":0},{"$f":"$BI$43","v":0},{"$f":"$BI$57","v":0},{"$f":"$BI$71","v":0},{"$f":"'Shape Limits'!$J$10","v":0},{"$f":"'Shape Limits'!$J$11","v":0}]
[null,"C","A111",{"$f":"$BJ$15","v":0},{"$f":"$BJ$29","v":0},{"$f":"$BJ$43","v":0},{"$f":"$BJ$57","v":0},{"$f":"$BJ$71","v":0},{"$f":"'Shape Limits'!$I$22","v":0},{"$f":"'Shape Limits'!$I$22","v":0}]
[null,"U","A112",{"$f":"$BK$15","v":0},{"$f":"$BK$29","v":0},{"$f":"$BK$43","v":0},{"$f":"$BK$57","v":0},{"$f":"$BK$71","v":0},{"$f":"'Shape Limits'!$J$31","v":0},{"$f":"'Shape Limits'!$J$32","v":0}]
[null,"K","A113",{"$f":"$BL$15","v":0},{"$f":"$BL$29","v":0},{"$f":"$BL$43","v":0},{"$f":"$BL$57","v":0},{"$f":"$BL$71","v":0},{"$f":"'Shape Limits'!$J$41","v":0},{"$f":"'Shape Limits'!$J$40","v":0}]
[null,"V","A114",{"$f":"$BM$15","v":0},{"$f":"$BM$29","v":0},{"$f":"$BM$43","v":0},{"$f":"$BM$57","v":0},{"$f":"$BM$71","v":0},{"$f":"'Shape Limits'!$J$49","v":0},{"$f":"'Shape Limits'!$J$48","v":0}]
[null,"L","A115",{"$f":"$BN$15","v":0},{"$f":"$BN$29","v":0},{"$f":"$BN$43","v":0},{"$f":"$BN$57","v":0},{"$f":"$BN$71","v":0},{"$f":"'Shape Limits'!$K$59","v":0},{"$f":"'Shape Limits'!$K$58","v":0}]
[null,"W","A116",{"$f":"$BO$15","v":0},{"$f":"$BO$29","v":0},{"$f":"$BO$43","v":0},{"$f":"$BO$57","v":0},{"$f":"$BO$71","v":0},{"$f":"'Shape Limits'!$J$71","v":0},{"$f":"'Shape Limits'!$J$70","v":0}]
[null,null,"A117",{"$f":"$BP$15","v":0},{"$f":"$BP$29","v":0},{"$f":"$BP$43","v":0},{"$f":"$BP$57","v":0},{"$f":"$BP$71","v":0},{"$f":"'Shape Limits'!J209","v":0},{"$f":"'Shape Limits'!J210","v":0}]
[null,"A","A118",{"$f":"$BQ$15","v":0},{"$f":"$BQ$29","v":0},{"$f":"$BQ$43","v":0},{"$f":"$BQ$57","v":0},{"$f":"$BQ$71","v":0},{"$f":"'Shape Limits'!$I$82","v":0},{"$f":"'Shape Limits'!$I$81","v":0}]
[null,"D","A119",{"$f":"$BR$15","v":0},{"$f":"$BR$29","v":0},{"$f":"$BR$43","v":0},{"$f":"$BR$57","v":0},{"$f":"$BR$71","v":0},{"$f":"'Shape Limits'!$U$106","v":0},{"$f":"'Shape Limits'!$U$107","v":0}]
[null,null,"A120",{"$f":"$BS$15","v":0},{"$f":"$BS$29","v":0},{"$f":"$BS$43","v":0},{"$f":"$BS$57","v":0},{"$f":"$BS$71","v":0},{"$f":"'Shape Limits'!J219","v":0},{"$f":"'Shape Limits'!J220","v":0}]
[null,null,"A121",{"$f":"$BT$15","v":0},{"$f":"$BT$29","v":0},{"$f":"$BT$43","v":0},{"$f":"$BT$57","v":0},{"$f":"$BT$71","v":0},{"$f":"'Shape Limits'!K230","v":0},{"$f":"'Shape Limits'!K231","v":0}]
[null,"G","A122",{"$f":"$BU$15","v":0},{"$f":"$BU$29","v":0},{"$f":"$BU$43","v":0},{"$f":"$BU$57","v":0},{"$f":"$BU$71","v":0},{"$f":"'Shape Limits'!$I$124","v":0},{"$f":"'Shape Limits'!$I$125","v":0}]
[null,null,"A123",{"$f":"$BV$15","v":0},{"$f":"$BV$29","v":0},{"$f":"$BV$43","v":0},{"$f":"$BV$57","v":0},{"$f":"$BV$71","v":0},{"$f":"'Shape Limits'!J241","v":0},{"$f":"'Shape Limits'!J242","v":0}]
[null,null,"A124",{"$f":"$BW$15","v":0},{"$f":"$BW$29","v":0},{"$f":"$BW$43","v":0},{"$f":"$BW$57","v":0},{"$f":"$BW$71","v":0},{"$f":"'Shape Limits'!I253","v":0},{"$f":"'Shape Limits'!I254","v":0}]
[null,"Z","A125",{"$f":"$BX$15","v":0},{"$f":"$BX$29","v":0},{"$f":"$BX$43","v":0},{"$f":"$BX$57","v":0},{"$f":"$BX$71","v":0},{"$f":"'Shape Limits'!$J$151","v":0},{"$f":"'Shape Limits'!$J$152","v":0}]
[null,"S","A126",{"$f":"$BY$15","v":0},{"$f":"$BY$29","v":0},{"$f":"$BY$43","v":0},{"$f":"$BY$57","v":0},{"$f":"$BY$71","v":0},{"$f":"'Shape Limits'!$J$162","v":0},{"$f":"'Shape Limits'!$J$159","v":0}]
[null,null,"A127",{"$f":"$BZ$15","v":0},{"$f":"$BZ$29","v":0},{"$f":"$BZ$43","v":0},{"$f":"$BZ$57","v":0},{"$f":"$BZ$71","v":0},{"$f":"'Shape Limits'!K261","v":0},{"$f":"'Shape Limits'!K262","v":0}]
[null,null,"A128",{"$f":"$CA$15","v":0},{"$f":"$CA$29","v":0},{"$f":"$CA$43","v":0},{"$f":"$CA$57","v":0},{"$f":"$CA$71","v":0},{"$f":"'Shape Limits'!K273","v":0},{"$f":"'Shape Limits'!K274","v":0}]
[null,"Q","A129",{"$f":"$CB$15","v":0},{"$f":"$CB$29","v":0},{"$f":"$CB$43","v":0},{"$f":"$CB$57","v":0},{"$f":"$CB$71","v":0},{"$f":"'Shape Limits'!$J$172","v":0},{"$f":"'Shape Limits'!$J$173","v":0}]
[null,"P","A130",{"$f":"$CC$15","v":0},{"$f":"$CC$29","v":0},{"$f":"$CC$43","v":0},{"$f":"$CC$57","v":0},{"$f":"$CC$71","v":0},{"$f":"'Shape Limits'!$J$182","v":0},{"$f":"'Shape Limits'!$J$183","v":0}]
[null,null,"A131",{"$f":"$CD$15","v":0},{"$f":"$CD$29","v":0},{"$f":"$CD$43","v":0},{"$f":"$CD$57","v":0},{"$f":"$CD$71","v":0},{"$f":"'Shape Limits'!J285","v":0},{"$f":"'Shape Limits'!J286","v":0}]
[null,"N","A132",{"$f":"$CE$15","v":0},{"$f":"$CE$29","v":0},{"$f":"$CE$43","v":0},{"$f":"$CE$57","v":0},{"$f":"$CE$71","v":0},{"$f":"'Shape Limits'!$K$193","v":0},{"$f":"'Shape Limits'!$K$194","v":0}]
[null,null,{"$f":"SHAPE","v":"Select"},{"$f":"IF(EXTR>1,VLOOKUP(SHAPE,MINMAXTABLE,2,FALSE),0)","v":0},{"$f":"IF(EXTR>1,VLOOKUP(SHAPE,MINMAXTABLE,3,FALSE),0)","v":0},{"$f":"IF(EXTR>1,VLOOKUP(SHAPE,MINMAXTABLE,4,FALSE),0)","v":0},{"$f":"IF(EXTR>1,VLOOKUP(SHAPE,MINMAXTABLE,5,FALSE),0)","v":0},{"$f":"IF(EXTR>1,VLOOKUP(SHAPE,MINMAXTABLE,6,FALSE),0)","v":0},{"$f":"IF(EXTR>1,VLOOKUP(SHAPE,MINMAXTABLE,7,FALSE),0)","v":0},{"$f":"IF(EXTR>1,VLOOKUP(SHAPE,MINMAXTABLE,8,FALSE),0)","v":0}]
[null,null,null,null,null,null,null,null,null,{"$f":"(GLASS_W*GLASS_H)/144","v":0}]